View Issue Details

IDProjectCategoryView StatusLast Update
0030888FPCCompilerpublic2016-11-07 16:46
ReporterMichlAssigned ToMichael Van Canneyt 
PrioritynormalSeverityminorReproducibilityhave not tried
Status closedResolutionfixed 
PlatformWindowsOS7OS Version32bit
Product Version3.1.1Product Build34823 
Target Version3.2.0Fixed in Version3.1.1 
Summary0030888: Revision 34823 breaks building of lazbuild.lpr
DescriptionAfter revision 34823 it isn't possible to compile Lazarus trunk (34822 works fine). My system is a 64bit Windows 7, I tryed to compile a 32bit Lazarus trunk (revision 53307) on 32bit FPC trunk.

The compiling is stopped with:

c:\FreePascalTest\laz\ide\lazbuild.lpr(105,45) Hint: (5024) Parameter "HelpKeywo
rd" not used
c:\FreePascalTest\laz\ide\lazbuild.lpr(617,97) Hint: (5091) Local variable "Inhe
ritedOptionStrings" of a managed type does not seem to be initialized
(9022) Compiling resource ..\units\i386-win32\nogui\lazbuild.or
An unhandled exception occurred at $0041DADA:
EStringListError: List index (7) out of bounds
  $0041DADA
  $0042727C
  $00427E33
  $00401F85
  $00402CF4

c:\FreePascalTest\laz\ide\lazbuild.lpr(1870,1) Error: (9029) Error while compili
ng resources
(9015) Linking ..\lazbuild.exe
c:\FreePascalTest\laz\ide\lazbuild.lpr(1870,1) Fatal: (10026) There were 1 error
s compiling module, stopping
Fatal: (1018) Compilation aborted
make[2]: *** [lazbuild.exe] Error 1
make[2]: Leaving directory `c:/FreePascalTest/laz/ide'
make[1]: *** [lazbuilder] Error 2
make[1]: Leaving directory `c:/FreePascalTest/laz/ide'
make: *** [lazbuild] Error 2
Additional Informationc:/freepascaltest/FPC/bin/i386-win32/ppc386.exe -MObjFPC -Scghi -CR -O1 -g -gl -l -vewnhibq -vm5024,4055 -dLCL -dLCLnogui -CR -dgc -Fu../../packager/units/i386-win32 -Fu../lazutils/lib/i386-win32 -Fu../../lcl/units/i386-win32 -Fu../../lcl/units/i386-win32/nogui -Fu. -FE. -FUunits/i386-win32/nogui -glw2 -di386 allsynedit.pas
TagsNo tags attached.
Fixed in Revision34834.
FPCOldBugId
FPCTarget
Attached Files

Activities

Michael Van Canneyt

2016-11-07 16:31

administrator   ~0095638

Please try with 34834.

Michl

2016-11-07 16:46

reporter   ~0095639

I was to slow to search the revision and it was the wrong one. Sorry for the confusion. It compiles fine now. Thank you

Issue History

Date Modified Username Field Change
2016-11-07 16:28 Michl New Issue
2016-11-07 16:30 Michael Van Canneyt Assigned To => Michael Van Canneyt
2016-11-07 16:30 Michael Van Canneyt Status new => assigned
2016-11-07 16:31 Michael Van Canneyt Fixed in Revision => 34834.
2016-11-07 16:31 Michael Van Canneyt Note Added: 0095638
2016-11-07 16:31 Michael Van Canneyt Status assigned => resolved
2016-11-07 16:31 Michael Van Canneyt Fixed in Version => 3.1.1
2016-11-07 16:31 Michael Van Canneyt Resolution open => fixed
2016-11-07 16:31 Michael Van Canneyt Target Version => 3.2.0
2016-11-07 16:46 Michl Note Added: 0095639
2016-11-07 16:46 Michl Status resolved => closed