View Issue Details

IDProjectCategoryView StatusLast Update
0031665FPCUtilitiespublic2017-04-15 14:50
ReporterThaddy de KoningAssigned ToMichael Van Canneyt 
PrioritynormalSeverityminorReproducibilityalways
Status resolvedResolutionfixed 
Platformx86_64OSwin64OS Version10.1
Product Version3.1.1Product Build34599 
Target Version3.2.0Fixed in Version3.1.1 
Summary0031665: x86_64-win64 build fails
DescriptionStart compiling package utils-fpdoc for target x86_64-win64.
       Compiling fpdoc\BuildUnit_utils_fpdoc.pp
       Compiling fpdoc\dglobals.pp
       Compiling fpdoc\dwriter.pp
       Compiling fpdoc\fpdocxmlopts.pas
       Compiling fpdoc\fpdocproj.pas
       Compiling fpdoc\dw_xml.pp
External command "E:/fpcsvn/compiler/ppcx64.exe -Twin64 -FUfpdoc\units\x86_64-win64\ -FuE:\fpcsvn\rtl\units\x86_64-win64\ -FuE:\fpcsvn\packages\fcl-base\units\x86_64-win64\ -FuE:\fpcsvn\packages\fcl-res\units\x86_64-win64\ -FuE:\fpcsvn\packages\rtl-objpas\units\x86_64-win64\ -FuE:\fpcsvn\packages\fcl-xml\units\x86_64-win64\ -FuE:\fpcsvn\packages\fcl-passrc\units\x86_64-win64\ -FuE:\fpcsvn\packages\fcl-process\units\x86_64-win64\ -FuE:\fpcsvn\packages\chm\units\x86_64-win64\ -XPx86_64-win64- -Xr -Ur -Xs -O2 -n -dREVINC -dx86_64 -dRELEASE -S2h -viq fpdoc\BuildUnit_utils_fpdoc.pp" failed with exit code 1. Console output:
Target OS: Win64 for x64
Compiling fpdoc\BuildUnit_utils_fpdoc.pp
Compiling fpdoc\dglobals.pp
Writing Resource String Table file: dglobals.rsj
Compiling fpdoc\dwriter.pp
Writing Resource String Table file: dwriter.rsj
Compiling fpdoc\fpdocxmlopts.pas
Compiling fpdoc\fpdocproj.pas
Writing Resource String Table file: fpdocxmlopts.rsj
Compiling fpdoc\dw_xml.pp
dw_xml.pp(103,8) Error: Identifier not found "pmStatic"
dw_xml.pp(629) Fatal: There were 1 errors compiling module, stopping
Fatal: Compilation aborted

The installer encountered the following error:
Compilation of "BuildUnit_utils_fpdoc.pp" failed
make[2]: *** [all] Error 1
make[2]: Leaving directory `E:/fpcsvn/utils'
make[1]: *** [utils_all] Error 2
make[1]: Leaving directory `E:/fpcsvn'
make: *** [build-stamp.x86_64-win64] Error 2
TagsNo tags attached.
Fixed in Revision35800
FPCOldBugId
FPCTarget
Attached Files

Activities

Thaddy de Koning

2017-04-15 14:22

reporter   ~0099608

35799 is the build

Michael Van Canneyt

2017-04-15 14:50

administrator   ~0099611

Fixed, thanks for reporting!

Issue History

Date Modified Username Field Change
2017-04-15 14:20 Thaddy de Koning New Issue
2017-04-15 14:22 Thaddy de Koning Note Added: 0099608
2017-04-15 14:27 Michael Van Canneyt Assigned To => Michael Van Canneyt
2017-04-15 14:27 Michael Van Canneyt Status new => assigned
2017-04-15 14:50 Michael Van Canneyt Fixed in Revision => 35800
2017-04-15 14:50 Michael Van Canneyt Note Added: 0099611
2017-04-15 14:50 Michael Van Canneyt Status assigned => resolved
2017-04-15 14:50 Michael Van Canneyt Fixed in Version => 3.1.1
2017-04-15 14:50 Michael Van Canneyt Resolution open => fixed
2017-04-15 14:50 Michael Van Canneyt Target Version => 3.2.0