View Issue Details

IDProjectCategoryView StatusLast Update
0036934FPCCompilerpublic2020-05-02 15:29
Reportersuve Assigned ToJonas Maebe  
PrioritynormalSeverityminorReproducibilityalways
Status resolvedResolutionfixed 
Platformppc64leOSLinux 
Fixed in Version3.3.1 
Summary0036934: Internal error 2002090904 when compiling BGRABitmap on ppc64le
DescriptionIn Fedora Rawhide (the development, rolling release) we upgraded FPC to 3.2.0-beta, using SVN revision 44680.

When compiling BGRABitmap v.10.8.1 (https://github.com/bgrabitmap/bgrabitmap), the build fails with an internal error:
    bgrabitmap/bgrapolygon.pas(866,1) Fatal: Internal error 2002090904

When compiling a cddciel (https://github.com/pchev/ccdciel/), a program that bundles its own, older copy of BGRABitmap (v.10.6.4), the same error occurs, albeit in a different file:
    bgrabitmap/bgradefaultbitmap.pas(2264,3) Fatal: Internal error 2002090904

The problem occurs only on ppc64le - on other architectures, the builds complete successfully.
See the attachment for build logs. If you need more information, I am willing to help.
TagsNo tags attached.
Fixed in Revision45199, 45204, 45205,45221
FPCOldBugId
FPCTarget3.2.0
Attached Files

Activities

suve

2020-04-19 14:20

reporter  

bgrabitmap-build.log (108,235 bytes)   
Mock Version: 2.1
Mock Version: 2.1
Mock Version: 2.1
ENTER ['do_with_status'](['bash', '--login', '-c', '/usr/bin/rpmbuild -bs --target ppc64le --nodeps /builddir/build/SPECS/bgrabitmap.spec'], chrootPath='/var/lib/mock/f33-build-20341434-1453796/root'env={'TERM': 'vt100', 'SHELL': '/bin/bash', 'HOME': '/builddir', 'HOSTNAME': 'mock', 'PATH': '/usr/bin:/bin:/usr/sbin:/sbin', 'PROMPT_COMMAND': 'printf "\\033]0;<mock-chroot>\\007"', 'PS1': '<mock-chroot> \\s-\\v\\$ ', 'LANG': 'C.UTF-8'}shell=Falselogger=<mockbuild.trace_decorator.getLog object at 0x7fff7ecb8a90>timeout=201600uid=1000gid=425user='mockbuild'nspawn_args=[]unshare_net=TrueprintOutput=False)
Executing command: ['bash', '--login', '-c', '/usr/bin/rpmbuild -bs --target ppc64le --nodeps /builddir/build/SPECS/bgrabitmap.spec'] with env {'TERM': 'vt100', 'SHELL': '/bin/bash', 'HOME': '/builddir', 'HOSTNAME': 'mock', 'PATH': '/usr/bin:/bin:/usr/sbin:/sbin', 'PROMPT_COMMAND': 'printf "\\033]0;<mock-chroot>\\007"', 'PS1': '<mock-chroot> \\s-\\v\\$ ', 'LANG': 'C.UTF-8'} and shell False
sh: fpc: command not found
sh: fpc: command not found
sh: fpc: command not found
Building target platforms: ppc64le
Building for target ppc64le
Wrote: /builddir/build/SRPMS/bgrabitmap-10.8.1-1.src.rpm
Child return code was: 0
ENTER ['do_with_status'](['bash', '--login', '-c', '/usr/bin/rpmbuild -bb --target ppc64le --nodeps /builddir/build/SPECS/bgrabitmap.spec'], chrootPath='/var/lib/mock/f33-build-20341434-1453796/root'env={'TERM': 'vt100', 'SHELL': '/bin/bash', 'HOME': '/builddir', 'HOSTNAME': 'mock', 'PATH': '/usr/bin:/bin:/usr/sbin:/sbin', 'PROMPT_COMMAND': 'printf "\\033]0;<mock-chroot>\\007"', 'PS1': '<mock-chroot> \\s-\\v\\$ ', 'LANG': 'C.UTF-8'}shell=Falselogger=<mockbuild.trace_decorator.getLog object at 0x7fff7ecb8a90>timeout=201600uid=1000gid=425user='mockbuild'nspawn_args=[]unshare_net=TrueprintOutput=False)
Executing command: ['bash', '--login', '-c', '/usr/bin/rpmbuild -bb --target ppc64le --nodeps /builddir/build/SPECS/bgrabitmap.spec'] with env {'TERM': 'vt100', 'SHELL': '/bin/bash', 'HOME': '/builddir', 'HOSTNAME': 'mock', 'PATH': '/usr/bin:/bin:/usr/sbin:/sbin', 'PROMPT_COMMAND': 'printf "\\033]0;<mock-chroot>\\007"', 'PS1': '<mock-chroot> \\s-\\v\\$ ', 'LANG': 'C.UTF-8'} and shell False
Building target platforms: ppc64le
Building for target ppc64le
Executing(%prep): /bin/sh -e /var/tmp/rpm-tmp.LVXIR1
+ umask 022
+ cd /builddir/build/BUILD
+ cd /builddir/build/BUILD
+ rm -rf bgrabitmap-10.8.1
+ /usr/bin/gzip -dc /builddir/build/SOURCES/bgrabitmap-10.8.1.tar.gz
+ /usr/bin/tar -xof -
+ STATUS=0
+ '[' 0 -ne 0 ']'
+ cd bgrabitmap-10.8.1
+ /usr/bin/chmod -Rf a+rX,u+w,g-w,o-w .
+ pushd bgrabitmap/
~/build/BUILD/bgrabitmap-10.8.1/bgrabitmap ~/build/BUILD/bgrabitmap-10.8.1
+ for LPK in bgrabitmappack bglcontrols
+ sed -e 's|<GenerateDebugInfo Value="False"/>|<GenerateDebugInfo Value="True"/><DebugInfoType Value="dsDwarf2"/>|g' -i bgrabitmappack.lpk
+ for LPK in bgrabitmappack bglcontrols
+ sed -e 's|<GenerateDebugInfo Value="False"/>|<GenerateDebugInfo Value="True"/><DebugInfoType Value="dsDwarf2"/>|g' -i bglcontrols.lpk
+ RPM_EC=0
++ jobs -p
+ exit 0
Executing(%build): /bin/sh -e /var/tmp/rpm-tmp.RUUKm5
+ umask 022
+ cd /builddir/build/BUILD
+ cd bgrabitmap-10.8.1
+ pushd bgrabitmap/
~/build/BUILD/bgrabitmap-10.8.1/bgrabitmap ~/build/BUILD/bgrabitmap-10.8.1
+ for LPK in bgrabitmappack bglcontrols
+ lazbuild bgrabitmappack.lpk
CopySecondaryConfigFile /etc/lazarus/environmentoptions.xml -> /builddir/.lazarus/environmentoptions.xml
Hint: (lazarus) [RunTool] "/usr/bin/fpc" "-iWTOTP"
Hint: (lazarus) [RunTool] "/usr/bin/fpc" "-va" "compilertest.pas"
Hint: (lazarus) [RunTool] "/usr/bin/fpc" "-iWTOTP" "-Ppowerpc64" "-Tlinux"
Hint: (lazarus) [RunTool] "/usr/bin/fpc" "-va" "compilertest.pas" "-Ppowerpc64" "-Tlinux"
Hint: (lazarus) Missing state file of BGRABitmapPack 10.8.1: /builddir/build/BUILD/bgrabitmap-10.8.1/bgrabitmap/lib/powerpc64-linux/3.2.0/BGRABitmapPack.compiled
Info: (lazarus) Execute Title="Compile package BGRABitmapPack 10.8.1"
Info: (lazarus) Working Directory="/builddir/build/BUILD/bgrabitmap-10.8.1/bgrabitmap/"
Info: (lazarus) Executable="/usr/bin/fpc"
Info: (lazarus) Param[0]="-B"
Info: (lazarus) Param[1]="-MObjFPC"
Info: (lazarus) Param[2]="-Scgi"
Info: (lazarus) Param[3]="-O3"
Info: (lazarus) Param[4]="-OoREGVAR"
Info: (lazarus) Param[5]="-gw2"
Info: (lazarus) Param[6]="-gl"
Info: (lazarus) Param[7]="-l"
Info: (lazarus) Param[8]="-vewnhibq"
Info: (lazarus) Param[9]="-Fu/usr/lib64/lazarus/packager/units/powerpc64-linux"
Info: (lazarus) Param[10]="-Fu/usr/lib64/lazarus/components/lazutils/lib/powerpc64-linux"
Info: (lazarus) Param[11]="-Fu/usr/lib64/lazarus/lcl/units/powerpc64-linux"
Info: (lazarus) Param[12]="-Fu/usr/lib64/lazarus/lcl/units/powerpc64-linux/gtk2"
Info: (lazarus) Param[13]="-Fu/builddir/build/BUILD/bgrabitmap-10.8.1/bgrabitmap/"
Info: (lazarus) Param[14]="-FU/builddir/build/BUILD/bgrabitmap-10.8.1/bgrabitmap/lib/powerpc64-linux/3.2.0/"
Info: (lazarus) Param[15]="-dLCL"
Info: (lazarus) Param[16]="-dLCLgtk2"
Info: (lazarus) Param[17]="bgrabitmappack.pas"
Hint: (11030) Start of reading config file /etc/fpc.cfg
Hint: (11031) End of reading config file /etc/fpc.cfg
Free Pascal Compiler version 3.2.0-beta [2020/04/12] for powerpc64
Copyright (c) 1993-2020 by Florian Klaempfl and others
(1002) Target OS: Linux for PowerPC64
(3104) Compiling bgrabitmappack.pas
(3104) Compiling bgraanimatedgif.pas
(3104) Compiling bgragraphics.pas
(9009) Assembling bgragraphics
(3104) Compiling bgrabitmap.pas
(3104) Compiling bgragtkbitmap.pas
(3104) Compiling bgralclbitmap.pas
(3104) Compiling bgrabitmaptypes.pas
(3104) Compiling bgramultifiletype.pas
(3104) Compiling bgrautf8.pas
(3104) Compiling bgraunicode.pas
/builddir/build/BUILD/bgrabitmap-10.8.1/bgrabitmap/bgraunicode.pas(739,88) Hint: (5024) Parameter "endOfSequence" not used
/builddir/build/BUILD/bgrabitmap-10.8.1/bgrabitmap/bgraunicode.pas(900,87) Hint: (5024) Parameter "endOfSequence" not used
(9009) Assembling bgraunicode
/builddir/build/BUILD/bgrabitmap-10.8.1/bgrabitmap/bgrautf8.pas(198,13) Warning: (5066) Symbol "UTF8CharacterLength" is deprecated: "Use UTF8CodepointSize instead."
(9009) Assembling bgrautf8
(3104) Compiling bgrabitmaptypes.pas
/builddir/build/BUILD/bgrabitmap-10.8.1/bgrabitmap/geometrytypes.inc(1106,13) Note: (6058) Call to subroutine "function GammaExpansion(c:TBGRAPixel):<record type>;" marked as inline is not inlined
/builddir/build/BUILD/bgrabitmap-10.8.1/bgrabitmap/geometrytypes.inc(1135,13) Note: (6058) Call to subroutine "function GammaExpansion(c:TBGRAPixel):<record type>;" marked as inline is not inlined
/builddir/build/BUILD/bgrabitmap-10.8.1/bgrabitmap/bezier.inc(254,21) Warning: (5093) function result variable of a managed type does not seem to be initialized
/builddir/build/BUILD/bgrabitmap-10.8.1/bgrabitmap/bezier.inc(494,21) Warning: (5093) function result variable of a managed type does not seem to be initialized
/builddir/build/BUILD/bgrabitmap-10.8.1/bgrabitmap/bezier.inc(834,20) Hint: (5091) Local variable "parts" of a managed type does not seem to be initialized
/builddir/build/BUILD/bgrabitmap-10.8.1/bgrabitmap/bezier.inc(932,19) Warning: (5093) function result variable of a managed type does not seem to be initialized
/builddir/build/BUILD/bgrabitmap-10.8.1/bgrabitmap/bezier.inc(148,55) Hint: (5024) Parameter "AData" not used
/builddir/build/BUILD/bgrabitmap-10.8.1/bgrabitmap/unibitmap.inc(1097,27) Hint: (5057) Local variable "temp" does not seem to be initialized
/builddir/build/BUILD/bgrabitmap-10.8.1/bgrabitmap/unibitmap.inc(1119,22) Hint: (5058) Variable "ADest" does not seem to be initialized
/builddir/build/BUILD/bgrabitmap-10.8.1/bgrabitmap/unibitmap.inc(1170,18) Hint: (5091) Local variable "pts" of a managed type does not seem to be initialized
/builddir/build/BUILD/bgrabitmap-10.8.1/bgrabitmap/unibitmap.inc(1429,5) Note: (6058) Call to subroutine "procedure TBridgedConversion.Convert(ASource:Pointer;ADest:Pointer;ACount:LongInt;ASourceStride:LongInt;ADestStride:LongInt;AReferenceWhite:PXYZReferenceWhite);" marked as inline is not inlined
/builddir/build/BUILD/bgrabitmap-10.8.1/bgrabitmap/unibitmap.inc(1429,83) Note: (6058) Call to subroutine "function PositiveMod(value:Int64;cycle:Int64):Int64;" marked as inline is not inlined
/builddir/build/BUILD/bgrabitmap-10.8.1/bgrabitmap/unibitmap.inc(1430,70) Note: (6058) Call to subroutine "function PositiveMod(value:Int64;cycle:Int64):Int64;" marked as inline is not inlined
/builddir/build/BUILD/bgrabitmap-10.8.1/bgrabitmap/unibitmap.inc(1439,5) Note: (6058) Call to subroutine "procedure TBridgedConversion.Convert(ASource:Pointer;ADest:Pointer;ACount:LongInt;ASourceStride:LongInt;ADestStride:LongInt;AReferenceWhite:PXYZReferenceWhite);" marked as inline is not inlined
/builddir/build/BUILD/bgrabitmap-10.8.1/bgrabitmap/unibitmap.inc(1439,87) Note: (6058) Call to subroutine "function PositiveMod(value:Int64;cycle:Int64):Int64;" marked as inline is not inlined
/builddir/build/BUILD/bgrabitmap-10.8.1/bgrabitmap/unibitmap.inc(1440,74) Note: (6058) Call to subroutine "function PositiveMod(value:Int64;cycle:Int64):Int64;" marked as inline is not inlined
/builddir/build/BUILD/bgrabitmap-10.8.1/bgrabitmap/unibitmap.inc(1450,16) Note: (6058) Call to subroutine "function PositiveMod(value:Int64;cycle:Int64):Int64;" marked as inline is not inlined
/builddir/build/BUILD/bgrabitmap-10.8.1/bgrabitmap/unibitmap.inc(1451,16) Note: (6058) Call to subroutine "function PositiveMod(value:Int64;cycle:Int64):Int64;" marked as inline is not inlined
/builddir/build/BUILD/bgrabitmap-10.8.1/bgrabitmap/unibitmap.inc(1459,5) Note: (6058) Call to subroutine "procedure TBridgedConversion.Convert(ASource:Pointer;ADest:Pointer;ACount:LongInt;ASourceStride:LongInt;ADestStride:LongInt;AReferenceWhite:PXYZReferenceWhite);" marked as inline is not inlined
/builddir/build/BUILD/bgrabitmap-10.8.1/bgrabitmap/unibitmap.inc(1476,5) Note: (6058) Call to subroutine "procedure TBridgedConversion.Convert(ASource:Pointer;ADest:Pointer;ACount:LongInt;ASourceStride:LongInt;ADestStride:LongInt;AReferenceWhite:PXYZReferenceWhite);" marked as inline is not inlined
/builddir/build/BUILD/bgrabitmap-10.8.1/bgrabitmap/unibitmap.inc(652,34) Hint: (5024) Parameter "pdest" not used
/builddir/build/BUILD/bgrabitmap-10.8.1/bgrabitmap/unibitmap.inc(652,58) Hint: (5024) Parameter "count" not used
/builddir/build/BUILD/bgrabitmap-10.8.1/bgrabitmap/unibitmap.inc(652,79) Hint: (5024) Parameter "mode" not used
/builddir/build/BUILD/bgrabitmap-10.8.1/bgrabitmap/unibitmap.inc(1515,42) Note: (6058) Call to subroutine "function PositiveMod(value:Int64;cycle:Int64):Int64;" marked as inline is not inlined
/builddir/build/BUILD/bgrabitmap-10.8.1/bgrabitmap/unibitmap.inc(637,36) Hint: (5024) Parameter "ARect" not used
/builddir/build/BUILD/bgrabitmap-10.8.1/bgrabitmap/unibitmap.inc(638,33) Hint: (5024) Parameter "X" not used
/builddir/build/BUILD/bgrabitmap-10.8.1/bgrabitmap/unibitmap.inc(638,41) Hint: (5024) Parameter "Y" not used
/builddir/build/BUILD/bgrabitmap-10.8.1/bgrabitmap/unibitmap.inc(661,42) Hint: (5024) Parameter "ACount" not used
/builddir/build/BUILD/bgrabitmap-10.8.1/bgrabitmap/unibitmap.inc(661,68) Hint: (5024) Parameter "AMask" not used
/builddir/build/BUILD/bgrabitmap-10.8.1/bgrabitmap/unibitmap.inc(661,95) Hint: (5024) Parameter "AStride" not used
/builddir/build/BUILD/bgrabitmap-10.8.1/bgrabitmap/unibitmap.inc(663,30) Hint: (5024) Parameter "X" not used
/builddir/build/BUILD/bgrabitmap-10.8.1/bgrabitmap/unibitmap.inc(663,37) Hint: (5024) Parameter "Y" not used
/builddir/build/BUILD/bgrabitmap-10.8.1/bgrabitmap/unibitmap.inc(1824,8) Note: (6058) Call to subroutine "function BGRA(red:Byte;green:Byte;blue:Byte;alpha:Byte):<record type>;" marked as inline is not inlined
/builddir/build/BUILD/bgrabitmap-10.8.1/bgrabitmap/unibitmap.inc(1879,8) Note: (6058) Call to subroutine "function BGRA(red:Byte;green:Byte;blue:Byte;alpha:Byte):<record type>;" marked as inline is not inlined
/builddir/build/BUILD/bgrabitmap-10.8.1/bgrabitmap/unibitmap.inc(197,41) Hint: (5024) Parameter "ABrush" not used
/builddir/build/BUILD/bgrabitmap-10.8.1/bgrabitmap/unibitmap.inc(197,71) Hint: (5024) Parameter "AAlpha" not used
/builddir/build/BUILD/bgrabitmap-10.8.1/bgrabitmap/unibitmap.inc(198,41) Hint: (5024) Parameter "ABrush" not used
/builddir/build/BUILD/bgrabitmap-10.8.1/bgrabitmap/unibitmap.inc(198,71) Hint: (5024) Parameter "AAlpha" not used
/builddir/build/BUILD/bgrabitmap-10.8.1/bgrabitmap/unibitmap.inc(2155,3) Note: (6058) Call to subroutine "procedure TBridgedConversion.Convert(ASource:Pointer;ADest:Pointer;ACount:LongInt;ASourceStride:LongInt;ADestStride:LongInt;AReferenceWhite:PXYZReferenceWhite);" marked as inline is not inlined
/builddir/build/BUILD/bgrabitmap-10.8.1/bgrabitmap/unibitmap.inc(2164,3) Note: (6058) Call to subroutine "procedure TBridgedConversion.Convert(ASource:Pointer;ADest:Pointer;ACount:LongInt;ASourceStride:LongInt;ADestStride:LongInt;AReferenceWhite:PXYZReferenceWhite);" marked as inline is not inlined
/builddir/build/BUILD/bgrabitmap-10.8.1/bgrabitmap/unibitmap.inc(2175,3) Note: (6058) Call to subroutine "procedure TBridgedConversion.Convert(ASource:Pointer;ADest:Pointer;ACount:LongInt;ASourceStride:LongInt;ADestStride:LongInt;AReferenceWhite:PXYZReferenceWhite);" marked as inline is not inlined
/builddir/build/BUILD/bgrabitmap-10.8.1/bgrabitmap/unibitmap.inc(2184,3) Note: (6058) Call to subroutine "procedure TBridgedConversion.Convert(ASource:Pointer;ADest:Pointer;ACount:LongInt;ASourceStride:LongInt;ADestStride:LongInt;AReferenceWhite:PXYZReferenceWhite);" marked as inline is not inlined
/builddir/build/BUILD/bgrabitmap-10.8.1/bgrabitmap/unibitmap.inc(66,40) Hint: (5024) Parameter "AAlpha" not used
/builddir/build/BUILD/bgrabitmap-10.8.1/bgrabitmap/unibitmap.inc(204,43) Hint: (5024) Parameter "ABrush" not used
/builddir/build/BUILD/bgrabitmap-10.8.1/bgrabitmap/unibitmap.inc(204,73) Hint: (5024) Parameter "AScanner" not used
/builddir/build/BUILD/bgrabitmap-10.8.1/bgrabitmap/unibitmap.inc(204,102) Hint: (5024) Parameter "ADrawMode" not used
/builddir/build/BUILD/bgrabitmap-10.8.1/bgrabitmap/unibitmap.inc(205,39) Hint: (5024) Parameter "AOffsetX" not used
/builddir/build/BUILD/bgrabitmap-10.8.1/bgrabitmap/unibitmap.inc(205,67) Hint: (5024) Parameter "AOffsetY" not used
/builddir/build/BUILD/bgrabitmap-10.8.1/bgrabitmap/unibitmap.inc(206,40) Hint: (5024) Parameter "ABrush" not used
/builddir/build/BUILD/bgrabitmap-10.8.1/bgrabitmap/unibitmap.inc(206,70) Hint: (5024) Parameter "AScanner" not used
/builddir/build/BUILD/bgrabitmap-10.8.1/bgrabitmap/unibitmap.inc(207,36) Hint: (5024) Parameter "AOffsetX" not used
/builddir/build/BUILD/bgrabitmap-10.8.1/bgrabitmap/unibitmap.inc(207,64) Hint: (5024) Parameter "AOffsetY" not used
/builddir/build/BUILD/bgrabitmap-10.8.1/bgrabitmap/unibitmap.inc(2322,3) Note: (6058) Call to subroutine "procedure TBridgedConversion.Convert(ASource:Pointer;ADest:Pointer;ACount:LongInt;ASourceStride:LongInt;ADestStride:LongInt;AReferenceWhite:PXYZReferenceWhite);" marked as inline is not inlined
/builddir/build/BUILD/bgrabitmap-10.8.1/bgrabitmap/unibitmap.inc(2331,3) Note: (6058) Call to subroutine "procedure TBridgedConversion.Convert(ASource:Pointer;ADest:Pointer;ACount:LongInt;ASourceStride:LongInt;ADestStride:LongInt;AReferenceWhite:PXYZReferenceWhite);" marked as inline is not inlined
/builddir/build/BUILD/bgrabitmap-10.8.1/bgrabitmap/unibitmap.inc(2396,9) Note: (6058) Call to subroutine "procedure TBridgedConversion.Convert(ASource:Pointer;ADest:Pointer;ACount:LongInt;ASourceStride:LongInt;ADestStride:LongInt;AReferenceWhite:PXYZReferenceWhite);" marked as inline is not inlined
/builddir/build/BUILD/bgrabitmap-10.8.1/bgrabitmap/unibitmap.inc(2471,12) Note: (6058) Call to subroutine "function PositiveMod(value:Int64;cycle:Int64):Int64;" marked as inline is not inlined
/builddir/build/BUILD/bgrabitmap-10.8.1/bgrabitmap/unibitmap.inc(2472,11) Note: (6058) Call to subroutine "function PositiveMod(value:Int64;cycle:Int64):Int64;" marked as inline is not inlined
/builddir/build/BUILD/bgrabitmap-10.8.1/bgrabitmap/unibitmap.inc(2549,27) Hint: (5057) Local variable "lWidth" does not seem to be initialized
/builddir/build/BUILD/bgrabitmap-10.8.1/bgrabitmap/unibitmap.inc(2550,28) Hint: (5057) Local variable "lHeight" does not seem to be initialized
/builddir/build/BUILD/bgrabitmap-10.8.1/bgrabitmap/unibitmap.inc(2944,51) Note: (6058) Call to subroutine "function PositiveMod(value:Int64;cycle:Int64):Int64;" marked as inline is not inlined
/builddir/build/BUILD/bgrabitmap-10.8.1/bgrabitmap/unibitmap.inc(2944,75) Note: (6058) Call to subroutine "function PositiveMod(value:Int64;cycle:Int64):Int64;" marked as inline is not inlined
/builddir/build/BUILD/bgrabitmap-10.8.1/bgrabitmap/unibitmapgeneric.inc(269,21) Note: (6058) Call to subroutine "operator =(const c1:TBGRAPixel;const c2:TBGRAPixel):Boolean;" marked as inline is not inlined
/builddir/build/BUILD/bgrabitmap-10.8.1/bgrabitmap/unibitmapgeneric.inc(287,19) Note: (6058) Call to subroutine "operator =(const c1:TBGRAPixel;const c2:TBGRAPixel):Boolean;" marked as inline is not inlined
/builddir/build/BUILD/bgrabitmap-10.8.1/bgrabitmap/unibitmapgeneric.inc(318,13) Note: (6058) Call to subroutine "operator =(const c1:TBGRAPixel;const c2:TBGRAPixel):Boolean;" marked as inline is not inlined
/builddir/build/BUILD/bgrabitmap-10.8.1/bgrabitmap/unibitmapgeneric.inc(498,11) Note: (6058) Call to subroutine "operator =(const c1:TBGRAPixel;const c2:TBGRAPixel):Boolean;" marked as inline is not inlined
/builddir/build/BUILD/bgrabitmap-10.8.1/bgrabitmap/unibitmapgeneric.inc(518,13) Note: (6058) Call to subroutine "operator =(const c1:TBGRAPixel;const c2:TBGRAPixel):Boolean;" marked as inline is not inlined
/builddir/build/BUILD/bgrabitmap-10.8.1/bgrabitmap/unibitmapgeneric.inc(452,63) Note: (6058) Call to subroutine "function PositiveMod(value:Int64;cycle:Int64):Int64;" marked as inline is not inlined
/builddir/build/BUILD/bgrabitmap-10.8.1/bgrabitmap/unibitmapgeneric.inc(452,67) Note: (6058) Call to subroutine "function PositiveMod(value:Int64;cycle:Int64):Int64;" marked as inline is not inlined
/builddir/build/BUILD/bgrabitmap-10.8.1/bgrabitmap/csscolorconst.inc(188,12) Note: (6058) Call to subroutine "function BGRA(red:Byte;green:Byte;blue:Byte):<record type>;" marked as inline is not inlined
/builddir/build/BUILD/bgrabitmap-10.8.1/bgrabitmap/csscolorconst.inc(236,17) Note: (6058) Call to subroutine "operator =(const c1:TBGRAPixel;const c2:TBGRAPixel):Boolean;" marked as inline is not inlined
/builddir/build/BUILD/bgrabitmap-10.8.1/bgrabitmap/csscolorconst.inc(545,13) Note: (6058) Call to subroutine "function BGRA(red:Byte;green:Byte;blue:Byte):<record type>;" marked as inline is not inlined
/builddir/build/BUILD/bgrabitmap-10.8.1/bgrabitmap/bgracustombitmap.inc(748,40) Note: (6058) Call to subroutine "function BGRA(red:Byte;green:Byte;blue:Byte;alpha:Byte):<record type>;" marked as inline is not inlined
/builddir/build/BUILD/bgrabitmap-10.8.1/bgrabitmap/bgracustombitmap.inc(749,41) Note: (6058) Call to subroutine "function BGRA(red:Byte;green:Byte;blue:Byte;alpha:Byte):<record type>;" marked as inline is not inlined
/builddir/build/BUILD/bgrabitmap-10.8.1/bgrabitmap/bgracustombitmap.inc(753,40) Note: (6058) Call to subroutine "function BGRA(red:Byte;green:Byte;blue:Byte;alpha:Byte):<record type>;" marked as inline is not inlined
/builddir/build/BUILD/bgrabitmap-10.8.1/bgrabitmap/bgracustombitmap.inc(754,41) Note: (6058) Call to subroutine "function BGRA(red:Byte;green:Byte;blue:Byte;alpha:Byte):<record type>;" marked as inline is not inlined
/builddir/build/BUILD/bgrabitmap-10.8.1/bgrabitmap/bgracustombitmap.inc(758,40) Note: (6058) Call to subroutine "function BGRA(red:Byte;green:Byte;blue:Byte;alpha:Byte):<record type>;" marked as inline is not inlined
/builddir/build/BUILD/bgrabitmap-10.8.1/bgrabitmap/bgracustombitmap.inc(759,41) Note: (6058) Call to subroutine "function BGRA(red:Byte;green:Byte;blue:Byte;alpha:Byte):<record type>;" marked as inline is not inlined
/builddir/build/BUILD/bgrabitmap-10.8.1/bgrabitmap/bgracustombitmap.inc(763,40) Note: (6058) Call to subroutine "function BGRA(red:Byte;green:Byte;blue:Byte;alpha:Byte):<record type>;" marked as inline is not inlined
/builddir/build/BUILD/bgrabitmap-10.8.1/bgrabitmap/bgracustombitmap.inc(764,41) Note: (6058) Call to subroutine "function BGRA(red:Byte;green:Byte;blue:Byte;alpha:Byte):<record type>;" marked as inline is not inlined
/builddir/build/BUILD/bgrabitmap-10.8.1/bgrabitmap/bgracustombitmap.inc(835,13) Note: (6058) Call to subroutine "function GammaExpansion(c:TBGRAPixel):<record type>;" marked as inline is not inlined
/builddir/build/BUILD/bgrabitmap-10.8.1/bgrabitmap/bgracustombitmap.inc(854,13) Note: (6058) Call to subroutine "function GammaExpansion(c:TBGRAPixel):<record type>;" marked as inline is not inlined
/builddir/build/BUILD/bgrabitmap-10.8.1/bgrabitmap/bgracustombitmap.inc(859,13) Note: (6058) Call to subroutine "function GammaExpansion(c:TBGRAPixel):<record type>;" marked as inline is not inlined
/builddir/build/BUILD/bgrabitmap-10.8.1/bgrabitmap/bgracustombitmap.inc(79,36) Hint: (5024) Parameter "ARect" not used
/builddir/build/BUILD/bgrabitmap-10.8.1/bgrabitmap/bgracustombitmap.inc(80,33) Hint: (5024) Parameter "X" not used
/builddir/build/BUILD/bgrabitmap-10.8.1/bgrabitmap/bgracustombitmap.inc(80,40) Hint: (5024) Parameter "Y" not used
/builddir/build/BUILD/bgrabitmap-10.8.1/bgrabitmap/bgracustombitmap.inc(1632,14) Note: (6058) Call to subroutine "function PositiveMod(value:Int64;cycle:Int64):Int64;" marked as inline is not inlined
/builddir/build/BUILD/bgrabitmap-10.8.1/bgrabitmap/bgracustombitmap.inc(1633,14) Note: (6058) Call to subroutine "function PositiveMod(value:Int64;cycle:Int64):Int64;" marked as inline is not inlined
/builddir/build/BUILD/bgrabitmap-10.8.1/bgrabitmap/bgracustombitmap.inc(1963,13) Note: (6058) Call to subroutine "function GammaExpansion(c:TBGRAPixel):<record type>;" marked as inline is not inlined
/builddir/build/BUILD/bgrabitmap-10.8.1/bgrabitmap/bgracustombitmap.inc(1968,13) Note: (6058) Call to subroutine "function GammaExpansion(c:TBGRAPixel):<record type>;" marked as inline is not inlined
/builddir/build/BUILD/bgrabitmap-10.8.1/bgrabitmap/bgracustombitmap.inc(1973,13) Note: (6058) Call to subroutine "function GammaExpansion(c:TBGRAPixel):<record type>;" marked as inline is not inlined
/builddir/build/BUILD/bgrabitmap-10.8.1/bgrabitmap/basiccolorspace.inc(269,13) Note: (6058) Call to subroutine "function GetIntensity(c:TBGRAPixel):Word;" marked as inline is not inlined
/builddir/build/BUILD/bgrabitmap-10.8.1/bgrabitmap/basiccolorspace.inc(354,13) Note: (6058) Call to subroutine "function BGRAToFPColor(AValue:TBGRAPixel):<record type>;" marked as inline is not inlined
/builddir/build/BUILD/bgrabitmap-10.8.1/bgrabitmap/basiccolorspace.inc(839,19) Warning: (5093) function result variable of a managed type does not seem to be initialized
/builddir/build/BUILD/bgrabitmap-10.8.1/bgrabitmap/basiccolorspace.inc(1425,11) Note: (6058) Call to subroutine "function BGRAToFPColor(AValue:TBGRAPixel):<record type>;" marked as inline is not inlined
/builddir/build/BUILD/bgrabitmap-10.8.1/bgrabitmap/extendedcolorspace.inc(224,29) Hint: (5058) Variable "ADest" does not seem to be initialized
/builddir/build/BUILD/bgrabitmap-10.8.1/bgrabitmap/extendedcolorspace.inc(296,15) Hint: (5024) Parameter "ASourceStride" not used
/builddir/build/BUILD/bgrabitmap-10.8.1/bgrabitmap/extendedcolorspace.inc(296,64) Hint: (5024) Parameter "AReferenceWhite" not used
/builddir/build/BUILD/bgrabitmap-10.8.1/bgrabitmap/generatedcolorspace.inc(1423,179) Hint: (5024) Parameter "AReferenceWhite" not used
/builddir/build/BUILD/bgrabitmap-10.8.1/bgrabitmap/generatedcolorspace.inc(1431,17) Note: (6058) Call to subroutine "function BGRAToFPColor(AValue:TBGRAPixel):<record type>;" marked as inline is not inlined
/builddir/build/BUILD/bgrabitmap-10.8.1/bgrabitmap/generatedcolorspace.inc(1434,175) Hint: (5024) Parameter "AReferenceWhite" not used
/builddir/build/BUILD/bgrabitmap-10.8.1/bgrabitmap/generatedcolorspace.inc(1445,175) Hint: (5024) Parameter "AReferenceWhite" not used
/builddir/build/BUILD/bgrabitmap-10.8.1/bgrabitmap/generatedcolorspace.inc(1456,175) Hint: (5024) Parameter "AReferenceWhite" not used
/builddir/build/BUILD/bgrabitmap-10.8.1/bgrabitmap/generatedcolorspace.inc(1467,175) Hint: (5024) Parameter "AReferenceWhite" not used
/builddir/build/BUILD/bgrabitmap-10.8.1/bgrabitmap/generatedcolorspace.inc(1477,175) Hint: (5024) Parameter "AReferenceWhite" not used
/builddir/build/BUILD/bgrabitmap-10.8.1/bgrabitmap/generatedcolorspace.inc(1487,177) Hint: (5024) Parameter "AReferenceWhite" not used
/builddir/build/BUILD/bgrabitmap-10.8.1/bgrabitmap/generatedcolorspace.inc(1498,187) Hint: (5024) Parameter "AReferenceWhite" not used
/builddir/build/BUILD/bgrabitmap-10.8.1/bgrabitmap/generatedcolorspace.inc(1505,179) Hint: (5024) Parameter "AReferenceWhite" not used
/builddir/build/BUILD/bgrabitmap-10.8.1/bgrabitmap/generatedcolorspace.inc(1512,183) Hint: (5024) Parameter "AReferenceWhite" not used
/builddir/build/BUILD/bgrabitmap-10.8.1/bgrabitmap/generatedcolorspace.inc(1515,25) Note: (6058) Call to subroutine "function BGRAToFPColor(AValue:TBGRAPixel):<record type>;" marked as inline is not inlined
/builddir/build/BUILD/bgrabitmap-10.8.1/bgrabitmap/generatedcolorspace.inc(1519,183) Hint: (5024) Parameter "AReferenceWhite" not used
/builddir/build/BUILD/bgrabitmap-10.8.1/bgrabitmap/generatedcolorspace.inc(1529,183) Hint: (5024) Parameter "AReferenceWhite" not used
/builddir/build/BUILD/bgrabitmap-10.8.1/bgrabitmap/generatedcolorspace.inc(1539,183) Hint: (5024) Parameter "AReferenceWhite" not used
/builddir/build/BUILD/bgrabitmap-10.8.1/bgrabitmap/generatedcolorspace.inc(1549,183) Hint: (5024) Parameter "AReferenceWhite" not used
/builddir/build/BUILD/bgrabitmap-10.8.1/bgrabitmap/generatedcolorspace.inc(1556,185) Hint: (5024) Parameter "AReferenceWhite" not used
/builddir/build/BUILD/bgrabitmap-10.8.1/bgrabitmap/generatedcolorspace.inc(1563,195) Hint: (5024) Parameter "AReferenceWhite" not used
/builddir/build/BUILD/bgrabitmap-10.8.1/bgrabitmap/generatedcolorspace.inc(1573,175) Hint: (5024) Parameter "AReferenceWhite" not used
/builddir/build/BUILD/bgrabitmap-10.8.1/bgrabitmap/generatedcolorspace.inc(1580,183) Hint: (5024) Parameter "AReferenceWhite" not used
/builddir/build/BUILD/bgrabitmap-10.8.1/bgrabitmap/generatedcolorspace.inc(1590,181) Hint: (5024) Parameter "AReferenceWhite" not used
/builddir/build/BUILD/bgrabitmap-10.8.1/bgrabitmap/generatedcolorspace.inc(1597,191) Hint: (5024) Parameter "AReferenceWhite" not used
/builddir/build/BUILD/bgrabitmap-10.8.1/bgrabitmap/generatedcolorspace.inc(1607,175) Hint: (5024) Parameter "AReferenceWhite" not used
/builddir/build/BUILD/bgrabitmap-10.8.1/bgrabitmap/generatedcolorspace.inc(1614,183) Hint: (5024) Parameter "AReferenceWhite" not used
/builddir/build/BUILD/bgrabitmap-10.8.1/bgrabitmap/generatedcolorspace.inc(1621,179) Hint: (5024) Parameter "AReferenceWhite" not used
/builddir/build/BUILD/bgrabitmap-10.8.1/bgrabitmap/generatedcolorspace.inc(1628,179) Hint: (5024) Parameter "AReferenceWhite" not used
/builddir/build/BUILD/bgrabitmap-10.8.1/bgrabitmap/generatedcolorspace.inc(1635,179) Hint: (5024) Parameter "AReferenceWhite" not used
/builddir/build/BUILD/bgrabitmap-10.8.1/bgrabitmap/generatedcolorspace.inc(1645,181) Hint: (5024) Parameter "AReferenceWhite" not used
/builddir/build/BUILD/bgrabitmap-10.8.1/bgrabitmap/generatedcolorspace.inc(1652,191) Hint: (5024) Parameter "AReferenceWhite" not used
/builddir/build/BUILD/bgrabitmap-10.8.1/bgrabitmap/generatedcolorspace.inc(1662,195) Hint: (5024) Parameter "AReferenceWhite" not used
/builddir/build/BUILD/bgrabitmap-10.8.1/bgrabitmap/generatedcolorspace.inc(1672,189) Hint: (5024) Parameter "AReferenceWhite" not used
/builddir/build/BUILD/bgrabitmap-10.8.1/bgrabitmap/generatedcolorspace.inc(1704,177) Hint: (5024) Parameter "AReferenceWhite" not used
/builddir/build/BUILD/bgrabitmap-10.8.1/bgrabitmap/generatedcolorspace.inc(1714,177) Hint: (5024) Parameter "AReferenceWhite" not used
/builddir/build/BUILD/bgrabitmap-10.8.1/bgrabitmap/generatedcolorspace.inc(1724,175) Hint: (5024) Parameter "AReferenceWhite" not used
/builddir/build/BUILD/bgrabitmap-10.8.1/bgrabitmap/generatedcolorspace.inc(1734,183) Hint: (5024) Parameter "AReferenceWhite" not used
/builddir/build/BUILD/bgrabitmap-10.8.1/bgrabitmap/generatedcolorspace.inc(1741,179) Hint: (5024) Parameter "AReferenceWhite" not used
/builddir/build/BUILD/bgrabitmap-10.8.1/bgrabitmap/generatedcolorspace.inc(1748,179) Hint: (5024) Parameter "AReferenceWhite" not used
/builddir/build/BUILD/bgrabitmap-10.8.1/bgrabitmap/generatedcolorspace.inc(1758,179) Hint: (5024) Parameter "AReferenceWhite" not used
/builddir/build/BUILD/bgrabitmap-10.8.1/bgrabitmap/generatedcolorspace.inc(1768,181) Hint: (5024) Parameter "AReferenceWhite" not used
/builddir/build/BUILD/bgrabitmap-10.8.1/bgrabitmap/generatedcolorspace.inc(1778,191) Hint: (5024) Parameter "AReferenceWhite" not used
/builddir/build/BUILD/bgrabitmap-10.8.1/bgrabitmap/generatedcolorspace.inc(1788,175) Hint: (5024) Parameter "AReferenceWhite" not used
/builddir/build/BUILD/bgrabitmap-10.8.1/bgrabitmap/generatedcolorspace.inc(1798,183) Hint: (5024) Parameter "AReferenceWhite" not used
/builddir/build/BUILD/bgrabitmap-10.8.1/bgrabitmap/generatedcolorspace.inc(1805,179) Hint: (5024) Parameter "AReferenceWhite" not used
/builddir/build/BUILD/bgrabitmap-10.8.1/bgrabitmap/generatedcolorspace.inc(1812,179) Hint: (5024) Parameter "AReferenceWhite" not used
/builddir/build/BUILD/bgrabitmap-10.8.1/bgrabitmap/generatedcolorspace.inc(1822,179) Hint: (5024) Parameter "AReferenceWhite" not used
/builddir/build/BUILD/bgrabitmap-10.8.1/bgrabitmap/generatedcolorspace.inc(1832,181) Hint: (5024) Parameter "AReferenceWhite" not used
/builddir/build/BUILD/bgrabitmap-10.8.1/bgrabitmap/generatedcolorspace.inc(1842,191) Hint: (5024) Parameter "AReferenceWhite" not used
/builddir/build/BUILD/bgrabitmap-10.8.1/bgrabitmap/generatedcolorspace.inc(1852,175) Hint: (5024) Parameter "AReferenceWhite" not used
/builddir/build/BUILD/bgrabitmap-10.8.1/bgrabitmap/generatedcolorspace.inc(1863,183) Hint: (5024) Parameter "AReferenceWhite" not used
/builddir/build/BUILD/bgrabitmap-10.8.1/bgrabitmap/generatedcolorspace.inc(1870,179) Hint: (5024) Parameter "AReferenceWhite" not used
/builddir/build/BUILD/bgrabitmap-10.8.1/bgrabitmap/generatedcolorspace.inc(1881,179) Hint: (5024) Parameter "AReferenceWhite" not used
/builddir/build/BUILD/bgrabitmap-10.8.1/bgrabitmap/generatedcolorspace.inc(1892,179) Hint: (5024) Parameter "AReferenceWhite" not used
/builddir/build/BUILD/bgrabitmap-10.8.1/bgrabitmap/generatedcolorspace.inc(1902,181) Hint: (5024) Parameter "AReferenceWhite" not used
/builddir/build/BUILD/bgrabitmap-10.8.1/bgrabitmap/generatedcolorspace.inc(1913,191) Hint: (5024) Parameter "AReferenceWhite" not used
/builddir/build/BUILD/bgrabitmap-10.8.1/bgrabitmap/generatedcolorspace.inc(1923,177) Hint: (5024) Parameter "AReferenceWhite" not used
/builddir/build/BUILD/bgrabitmap-10.8.1/bgrabitmap/generatedcolorspace.inc(1930,185) Hint: (5024) Parameter "AReferenceWhite" not used
/builddir/build/BUILD/bgrabitmap-10.8.1/bgrabitmap/generatedcolorspace.inc(1938,17) Note: (6058) Call to subroutine "function BGRAToFPColor(AValue:TBGRAPixel):<record type>;" marked as inline is not inlined
/builddir/build/BUILD/bgrabitmap-10.8.1/bgrabitmap/generatedcolorspace.inc(1941,181) Hint: (5024) Parameter "AReferenceWhite" not used
/builddir/build/BUILD/bgrabitmap-10.8.1/bgrabitmap/generatedcolorspace.inc(1952,181) Hint: (5024) Parameter "AReferenceWhite" not used
/builddir/build/BUILD/bgrabitmap-10.8.1/bgrabitmap/generatedcolorspace.inc(1963,181) Hint: (5024) Parameter "AReferenceWhite" not used
/builddir/build/BUILD/bgrabitmap-10.8.1/bgrabitmap/generatedcolorspace.inc(1974,181) Hint: (5024) Parameter "AReferenceWhite" not used
/builddir/build/BUILD/bgrabitmap-10.8.1/bgrabitmap/generatedcolorspace.inc(1984,181) Hint: (5024) Parameter "AReferenceWhite" not used
/builddir/build/BUILD/bgrabitmap-10.8.1/bgrabitmap/generatedcolorspace.inc(1991,193) Hint: (5024) Parameter "AReferenceWhite" not used
/builddir/build/BUILD/bgrabitmap-10.8.1/bgrabitmap/generatedcolorspace.inc(2001,187) Hint: (5024) Parameter "AReferenceWhite" not used
/builddir/build/BUILD/bgrabitmap-10.8.1/bgrabitmap/generatedcolorspace.inc(2008,195) Hint: (5024) Parameter "AReferenceWhite" not used
/builddir/build/BUILD/bgrabitmap-10.8.1/bgrabitmap/generatedcolorspace.inc(2015,191) Hint: (5024) Parameter "AReferenceWhite" not used
/builddir/build/BUILD/bgrabitmap-10.8.1/bgrabitmap/generatedcolorspace.inc(2022,191) Hint: (5024) Parameter "AReferenceWhite" not used
/builddir/build/BUILD/bgrabitmap-10.8.1/bgrabitmap/generatedcolorspace.inc(2032,195) Hint: (5024) Parameter "AReferenceWhite" not used
/builddir/build/BUILD/bgrabitmap-10.8.1/bgrabitmap/generatedcolorspace.inc(2042,191) Hint: (5024) Parameter "AReferenceWhite" not used
/builddir/build/BUILD/bgrabitmap-10.8.1/bgrabitmap/generatedcolorspace.inc(2052,191) Hint: (5024) Parameter "AReferenceWhite" not used
/builddir/build/BUILD/bgrabitmap-10.8.1/bgrabitmap/generatedcolorspace.inc(2062,191) Hint: (5024) Parameter "AReferenceWhite" not used
/builddir/build/BUILD/bgrabitmap-10.8.1/bgrabitmap/generatedcolorspace.inc(2069,193) Hint: (5024) Parameter "AReferenceWhite" not used
/builddir/build/BUILD/bgrabitmap-10.8.1/bgrabitmap/generatedcolorspace.inc(2076,197) Hint: (5024) Parameter "AReferenceWhite" not used
/builddir/build/BUILD/bgrabitmap-10.8.1/bgrabitmap/generatedcolorspace.inc(2083,195) Hint: (5024) Parameter "AReferenceWhite" not used
/builddir/build/BUILD/bgrabitmap-10.8.1/bgrabitmap/generatedcolorspace.inc(2090,195) Hint: (5024) Parameter "AReferenceWhite" not used
/builddir/build/BUILD/bgrabitmap-10.8.1/bgrabitmap/generatedcolorspace.inc(2122,185) Hint: (5024) Parameter "AReferenceWhite" not used
/builddir/build/BUILD/bgrabitmap-10.8.1/bgrabitmap/generatedcolorspace.inc(2132,185) Hint: (5024) Parameter "AReferenceWhite" not used
/builddir/build/BUILD/bgrabitmap-10.8.1/bgrabitmap/generatedcolorspace.inc(2142,189) Hint: (5024) Parameter "AReferenceWhite" not used
/builddir/build/BUILD/bgrabitmap-10.8.1/bgrabitmap/generatedcolorspace.inc(2149,197) Hint: (5024) Parameter "AReferenceWhite" not used
/builddir/build/BUILD/bgrabitmap-10.8.1/bgrabitmap/generatedcolorspace.inc(2167,179) Hint: (5024) Parameter "AReferenceWhite" not used
/builddir/build/BUILD/bgrabitmap-10.8.1/bgrabitmap/generatedcolorspace.inc(2177,179) Hint: (5024) Parameter "AReferenceWhite" not used
/builddir/build/BUILD/bgrabitmap-10.8.1/bgrabitmap/generatedcolorspace.inc(2184,195) Hint: (5024) Parameter "AReferenceWhite" not used
/builddir/build/BUILD/bgrabitmap-10.8.1/bgrabitmap/generatedcolorspace.inc(2191,187) Hint: (5024) Parameter "AReferenceWhite" not used
/builddir/build/BUILD/bgrabitmap-10.8.1/bgrabitmap/generatedcolorspace.inc(2198,195) Hint: (5024) Parameter "AReferenceWhite" not used
/builddir/build/BUILD/bgrabitmap-10.8.1/bgrabitmap/generatedcolorspace.inc(2205,187) Hint: (5024) Parameter "AReferenceWhite" not used
/builddir/build/BUILD/bgrabitmap-10.8.1/bgrabitmap/generatedcolorspace.inc(2242,175) Hint: (5024) Parameter "AReferenceWhite" not used
/builddir/build/BUILD/bgrabitmap-10.8.1/bgrabitmap/generatedcolorspace.inc(2293,175) Hint: (5024) Parameter "AReferenceWhite" not used
/builddir/build/BUILD/bgrabitmap-10.8.1/bgrabitmap/generatedcolorspace.inc(2331,177) Hint: (5024) Parameter "AReferenceWhite" not used
/builddir/build/BUILD/bgrabitmap-10.8.1/bgrabitmap/generatedcolorspace.inc(2341,185) Hint: (5024) Parameter "AReferenceWhite" not used
/builddir/build/BUILD/bgrabitmap-10.8.1/bgrabitmap/generatedcolorspace.inc(2351,179) Hint: (5024) Parameter "AReferenceWhite" not used
/builddir/build/BUILD/bgrabitmap-10.8.1/bgrabitmap/generatedcolorspace.inc(2380,167) Hint: (5024) Parameter "AReferenceWhite" not used
/builddir/build/BUILD/bgrabitmap-10.8.1/bgrabitmap/generatedcolorspace.inc(2390,177) Hint: (5024) Parameter "AReferenceWhite" not used
/builddir/build/BUILD/bgrabitmap-10.8.1/bgrabitmap/generatedcolorspace.inc(2400,185) Hint: (5024) Parameter "AReferenceWhite" not used
/builddir/build/BUILD/bgrabitmap-10.8.1/bgrabitmap/generatedcolorspace.inc(2410,179) Hint: (5024) Parameter "AReferenceWhite" not used
/builddir/build/BUILD/bgrabitmap-10.8.1/bgrabitmap/generatedcolorspace.inc(2445,167) Hint: (5024) Parameter "AReferenceWhite" not used
/builddir/build/BUILD/bgrabitmap-10.8.1/bgrabitmap/generatedcolorspace.inc(110,46) Hint: (5024) Parameter "AColor" not used
/builddir/build/BUILD/bgrabitmap-10.8.1/bgrabitmap/generatedcolorspace.inc(113,44) Hint: (5024) Parameter "AIndex" not used
/builddir/build/BUILD/bgrabitmap-10.8.1/bgrabitmap/generatedcolorspace.inc(130,44) Hint: (5024) Parameter "AIndex" not used
/builddir/build/BUILD/bgrabitmap-10.8.1/bgrabitmap/generatedcolorspace.inc(147,44) Hint: (5024) Parameter "AIndex" not used
/builddir/build/BUILD/bgrabitmap-10.8.1/bgrabitmap/generatedcolorspace.inc(164,44) Hint: (5024) Parameter "AIndex" not used
/builddir/build/BUILD/bgrabitmap-10.8.1/bgrabitmap/generatedcolorspace.inc(181,44) Hint: (5024) Parameter "AIndex" not used
/builddir/build/BUILD/bgrabitmap-10.8.1/bgrabitmap/generatedcolorspace.inc(198,44) Hint: (5024) Parameter "AIndex" not used
/builddir/build/BUILD/bgrabitmap-10.8.1/bgrabitmap/generatedcolorspace.inc(215,44) Hint: (5024) Parameter "AIndex" not used
/builddir/build/BUILD/bgrabitmap-10.8.1/bgrabitmap/generatedcolorspace.inc(229,46) Hint: (5024) Parameter "AColor" not used
/builddir/build/BUILD/bgrabitmap-10.8.1/bgrabitmap/generatedcolorspace.inc(232,44) Hint: (5024) Parameter "AIndex" not used
/builddir/build/BUILD/bgrabitmap-10.8.1/bgrabitmap/generatedcolorspace.inc(246,46) Hint: (5024) Parameter "AColor" not used
/builddir/build/BUILD/bgrabitmap-10.8.1/bgrabitmap/generatedcolorspace.inc(249,44) Hint: (5024) Parameter "AIndex" not used
/builddir/build/BUILD/bgrabitmap-10.8.1/bgrabitmap/generatedcolorspace.inc(266,44) Hint: (5024) Parameter "AIndex" not used
/builddir/build/BUILD/bgrabitmap-10.8.1/bgrabitmap/generatedcolorspace.inc(283,44) Hint: (5024) Parameter "AIndex" not used
/builddir/build/BUILD/bgrabitmap-10.8.1/bgrabitmap/generatedcolorspace.inc(300,44) Hint: (5024) Parameter "AIndex" not used
/builddir/build/BUILD/bgrabitmap-10.8.1/bgrabitmap/generatedcolorspace.inc(317,44) Hint: (5024) Parameter "AIndex" not used
/builddir/build/BUILD/bgrabitmap-10.8.1/bgrabitmap/generatedcolorspace.inc(334,44) Hint: (5024) Parameter "AIndex" not used
/builddir/build/BUILD/bgrabitmap-10.8.1/bgrabitmap/generatedcolorspace.inc(351,44) Hint: (5024) Parameter "AIndex" not used
/builddir/build/BUILD/bgrabitmap-10.8.1/bgrabitmap/generatedcolorspace.inc(368,44) Hint: (5024) Parameter "AIndex" not used
/builddir/build/BUILD/bgrabitmap-10.8.1/bgrabitmap/generatedcolorspace.inc(385,44) Hint: (5024) Parameter "AIndex" not used
/builddir/build/BUILD/bgrabitmap-10.8.1/bgrabitmap/generatedcolorspace.inc(5637,7) Note: (6058) Call to subroutine "procedure ChromaticAdaptXYZ(var X:Single;var Y:Single;var Z:Single;const AFrom:TXYZReferenceWhite;const ATo:TXYZReferenceWhite);" marked as inline is not inlined
/builddir/build/BUILD/bgrabitmap-10.8.1/bgrabitmap/generatedcolorspace.inc(5831,7) Note: (6058) Call to subroutine "procedure ChromaticAdaptWordXYZ(var X:Word;var Y:Word;var Z:Word;const AFrom:TXYZReferenceWhite;const ATo:TXYZReferenceWhite);" marked as inline is not inlined
/builddir/build/BUILD/bgrabitmap-10.8.1/bgrabitmap/bgrabitmaptypes.pas(657,19) Hint: (5094) Function result variable of a managed type does not seem to be initialized
/builddir/build/BUILD/bgrabitmap-10.8.1/bgrabitmap/bgrabitmaptypes.pas(398,48) Hint: (5024) Parameter "orientationTenthDegCCW" not used
/builddir/build/BUILD/bgrabitmap-10.8.1/bgrabitmap/bgrabitmaptypes.pas(399,49) Hint: (5024) Parameter "orientationTenthDegCCW" not used
/builddir/build/BUILD/bgrabitmap-10.8.1/bgrabitmap/bgrabitmaptypes.pas(407,117) Hint: (5024) Parameter "ARightToLeft" not used
/builddir/build/BUILD/bgrabitmap-10.8.1/bgrabitmap/bgrabitmaptypes.pas(412,125) Hint: (5024) Parameter "ARightToLeft" not used
/builddir/build/BUILD/bgrabitmap-10.8.1/bgrabitmap/bgrabitmaptypes.pas(416,155) Hint: (5024) Parameter "ARightToLeft" not used
/builddir/build/BUILD/bgrabitmap-10.8.1/bgrabitmap/bgrabitmaptypes.pas(419,163) Hint: (5024) Parameter "ARightToLeft" not used
/builddir/build/BUILD/bgrabitmap-10.8.1/bgrabitmap/bgrabitmaptypes.pas(433,35) Hint: (5024) Parameter "ADest" not used
/builddir/build/BUILD/bgrabitmap-10.8.1/bgrabitmap/bgrabitmaptypes.pas(433,58) Hint: (5024) Parameter "x" not used
/builddir/build/BUILD/bgrabitmap-10.8.1/bgrabitmap/bgrabitmaptypes.pas(433,66) Hint: (5024) Parameter "y" not used
/builddir/build/BUILD/bgrabitmap-10.8.1/bgrabitmap/bgrabitmaptypes.pas(433,82) Hint: (5024) Parameter "s" not used
/builddir/build/BUILD/bgrabitmap-10.8.1/bgrabitmap/bgrabitmaptypes.pas(433,98) Hint: (5024) Parameter "align" not used
/builddir/build/BUILD/bgrabitmap-10.8.1/bgrabitmap/bgrabitmaptypes.pas(434,122) Hint: (5024) Parameter "ARightToLeft" not used
/builddir/build/BUILD/bgrabitmap-10.8.1/bgrabitmap/bgrabitmaptypes.pas(1059,48) Hint: (5057) Local variable "targaPixelFormat" does not seem to be initialized
/builddir/build/BUILD/bgrabitmap-10.8.1/bgrabitmap/bgrabitmaptypes.pas(1115,24) Hint: (5057) Local variable "magic" does not seem to be initialized
/builddir/build/BUILD/bgrabitmap-10.8.1/bgrabitmap/bgrabitmaptypes.pas(1126,26) Hint: (5091) Local variable "magicAsText" of a managed type does not seem to be initialized
/builddir/build/BUILD/bgrabitmap-10.8.1/bgrabitmap/bgrabitmaptypes.pas(1213,26) Hint: (5091) Local variable "moreMagic" of a managed type does not seem to be initialized
(9009) Assembling bgrabitmaptypes
/usr/lib64/fpc/3.2.0/units/powerpc64-linux/rtl/fgl.ppu:fgl.pp(930,1) Hint: (3123) "inherited" not yet supported inside inline procedure/function
/usr/lib64/fpc/3.2.0/units/powerpc64-linux/rtl/fgl.ppu:fgl.pp(930,1) Hint: (3124) Inlining disabled
/usr/lib64/fpc/3.2.0/units/powerpc64-linux/rtl/fgl.ppu:fgl.pp(945,1) Hint: (3123) "inherited" not yet supported inside inline procedure/function
/usr/lib64/fpc/3.2.0/units/powerpc64-linux/rtl/fgl.ppu:fgl.pp(945,1) Hint: (3124) Inlining disabled
/usr/lib64/fpc/3.2.0/units/powerpc64-linux/rtl/fgl.ppu:fgl.pp(1005,1) Hint: (3123) "inherited" not yet supported inside inline procedure/function
/usr/lib64/fpc/3.2.0/units/powerpc64-linux/rtl/fgl.ppu:fgl.pp(1005,1) Hint: (3124) Inlining disabled
/usr/lib64/fpc/3.2.0/units/powerpc64-linux/rtl/fgl.ppu:fgl.pp(1010,1) Hint: (3123) "inherited" not yet supported inside inline procedure/function
/usr/lib64/fpc/3.2.0/units/powerpc64-linux/rtl/fgl.ppu:fgl.pp(1010,1) Hint: (3124) Inlining disabled
/usr/lib64/fpc/3.2.0/units/powerpc64-linux/rtl/fgl.ppu:fgl.pp(963,1) Hint: (3123) "inherited" not yet supported inside inline procedure/function
/usr/lib64/fpc/3.2.0/units/powerpc64-linux/rtl/fgl.ppu:fgl.pp(963,1) Hint: (3124) Inlining disabled
/usr/lib64/fpc/3.2.0/units/powerpc64-linux/rtl/fgl.ppu:fgl.pp(968,1) Hint: (3123) "inherited" not yet supported inside inline procedure/function
/usr/lib64/fpc/3.2.0/units/powerpc64-linux/rtl/fgl.ppu:fgl.pp(968,1) Hint: (3124) Inlining disabled
/usr/lib64/fpc/3.2.0/units/powerpc64-linux/rtl/fgl.ppu:fgl.pp(950,1) Hint: (3123) "inherited" not yet supported inside inline procedure/function
/usr/lib64/fpc/3.2.0/units/powerpc64-linux/rtl/fgl.ppu:fgl.pp(950,1) Hint: (3124) Inlining disabled
/usr/lib64/fpc/3.2.0/units/powerpc64-linux/rtl/fgl.ppu:fgl.pp(955,1) Hint: (3123) "inherited" not yet supported inside inline procedure/function
/usr/lib64/fpc/3.2.0/units/powerpc64-linux/rtl/fgl.ppu:fgl.pp(955,1) Hint: (3124) Inlining disabled
/usr/lib64/fpc/3.2.0/units/powerpc64-linux/rtl/fgl.ppu:fgl.pp(997,1) Hint: (3123) "inherited" not yet supported inside inline procedure/function
/usr/lib64/fpc/3.2.0/units/powerpc64-linux/rtl/fgl.ppu:fgl.pp(997,1) Hint: (3124) Inlining disabled
/usr/lib64/fpc/3.2.0/units/powerpc64-linux/rtl/fgl.ppu:fgl.pp(1023,7) Note: (6058) Call to subroutine "function TFPGList<BGRAMultiFileType.TMultiFileEntry>.Add(const Item:TMultiFileEntry):LongInt;" marked as inline is not inlined
/usr/lib64/fpc/3.2.0/units/powerpc64-linux/rtl/fgl.ppu:fgl.pp(1023,20) Note: (6058) Call to subroutine "function TFPGList<BGRAMultiFileType.TMultiFileEntry>.Get(Index:LongInt):TMultiFileEntry;" marked as inline is not inlined
/builddir/build/BUILD/bgrabitmap-10.8.1/bgrabitmap/bgramultifiletype.pas(49,26) Hint: (5024) Parameter "ADestination" not used
/builddir/build/BUILD/bgrabitmap-10.8.1/bgrabitmap/bgramultifiletype.pas(224,21) Note: (6058) Call to subroutine "function TFPGList<BGRAMultiFileType.TMultiFileEntry>.Get(Index:LongInt):TMultiFileEntry;" marked as inline is not inlined
/builddir/build/BUILD/bgrabitmap-10.8.1/bgrabitmap/bgramultifiletype.pas(280,5) Note: (6058) Call to subroutine "procedure TFPGList<BGRAMultiFileType.TMultiFileEntry>.Insert(Index:LongInt;const Item:TMultiFileEntry);" marked as inline is not inlined
/builddir/build/BUILD/bgrabitmap-10.8.1/bgrabitmap/bgramultifiletype.pas(284,23) Note: (6058) Call to subroutine "function TFPGList<BGRAMultiFileType.TMultiFileEntry>.Add(const Item:TMultiFileEntry):LongInt;" marked as inline is not inlined
/builddir/build/BUILD/bgrabitmap-10.8.1/bgrabitmap/bgramultifiletype.pas(488,22) Note: (6058) Call to subroutine "function TFPGList<BGRAMultiFileType.TMultiFileEntry>.Get(Index:LongInt):TMultiFileEntry;" marked as inline is not inlined
(9009) Assembling bgramultifiletype
(3104) Compiling bgradefaultbitmap.pas
(3104) Compiling bgracanvas.pas
(3104) Compiling bgrapen.pas
(3104) Compiling bgratransform.pas
(3104) Compiling bgrablend.pas
/builddir/build/BUILD/bgrabitmap-10.8.1/bgrabitmap/bgrablend.pas(158,11) Note: (6058) Call to subroutine "procedure DrawExpandedPixelInlineNoAlphaCheck(dest:PBGRAPixel;const ec:TExpandedPixel;calpha:Byte);" marked as inline is not inlined
/builddir/build/BUILD/bgrabitmap-10.8.1/bgrabitmap/bgrablend.pas(177,41) Hint: (5024) Parameter "AFixedData" not used
/builddir/build/BUILD/bgrabitmap-10.8.1/bgrabitmap/bgrablend.pas(178,40) Hint: (5024) Parameter "AAlpha" not used
/builddir/build/BUILD/bgrabitmap-10.8.1/bgrabitmap/bgrablend.pas(206,9) Note: (6058) Call to subroutine "procedure DrawExpandedPixelInlineNoAlphaCheck(dest:PBGRAPixel;const ec:TExpandedPixel;calpha:Byte);" marked as inline is not inlined
/builddir/build/BUILD/bgrabitmap-10.8.1/bgrabitmap/bgrablend.pas(233,9) Note: (6058) Call to subroutine "procedure FastBlendPixelInline(dest:PBGRAPixel;const c:TBGRAPixel);" marked as inline is not inlined
/builddir/build/BUILD/bgrabitmap-10.8.1/bgrabitmap/bgrablend.pas(243,9) Note: (6058) Call to subroutine "procedure FastBlendPixelInline(dest:PBGRAPixel;const c:TBGRAPixel);" marked as inline is not inlined
/builddir/build/BUILD/bgrabitmap-10.8.1/bgrabitmap/bgrablend.pas(384,50) Warning: (5036) Local variable "buf" does not seem to be initialized
/builddir/build/BUILD/bgrabitmap-10.8.1/bgrabitmap/bgrablend.pas(494,50) Warning: (5036) Local variable "buf" does not seem to be initialized
/builddir/build/BUILD/bgrabitmap-10.8.1/bgrabitmap/bgrablend.pas(603,11) Note: (6058) Call to subroutine "procedure DrawPixelInlineWithAlphaCheck(dest:PBGRAPixel;const c:TBGRAPixel);" marked as inline is not inlined
/builddir/build/BUILD/bgrabitmap-10.8.1/bgrabitmap/bgrablend.pas(615,11) Note: (6058) Call to subroutine "procedure DrawPixelInlineWithAlphaCheck(dest:PBGRAPixel;c:TBGRAPixel;appliedOpacity:Byte);" marked as inline is not inlined
/builddir/build/BUILD/bgrabitmap-10.8.1/bgrabitmap/bgrablend.pas(616,11) Note: (6058) Call to subroutine "procedure DrawPixelInlineWithAlphaCheck(dest:PBGRAPixel;c:TBGRAPixel;appliedOpacity:Byte);" marked as inline is not inlined
/builddir/build/BUILD/bgrabitmap-10.8.1/bgrabitmap/bgrablend.pas(617,11) Note: (6058) Call to subroutine "procedure DrawPixelInlineWithAlphaCheck(dest:PBGRAPixel;c:TBGRAPixel;appliedOpacity:Byte);" marked as inline is not inlined
/builddir/build/BUILD/bgrabitmap-10.8.1/bgrabitmap/bgrablend.pas(618,11) Note: (6058) Call to subroutine "procedure DrawPixelInlineWithAlphaCheck(dest:PBGRAPixel;c:TBGRAPixel;appliedOpacity:Byte);" marked as inline is not inlined
/builddir/build/BUILD/bgrabitmap-10.8.1/bgrabitmap/bgrablend.pas(626,9) Note: (6058) Call to subroutine "procedure DrawPixelInlineWithAlphaCheck(dest:PBGRAPixel;c:TBGRAPixel;appliedOpacity:Byte);" marked as inline is not inlined
/builddir/build/BUILD/bgrabitmap-10.8.1/bgrabitmap/bgrablend.pas(614,50) Warning: (5036) Local variable "buf" does not seem to be initialized
/builddir/build/BUILD/bgrabitmap-10.8.1/bgrabitmap/bgrablend.pas(665,13) Note: (6058) Call to subroutine "procedure DrawPixelInlineWithAlphaCheck(dest:PBGRAPixel;const c:TBGRAPixel);" marked as inline is not inlined
/builddir/build/BUILD/bgrabitmap-10.8.1/bgrabitmap/bgrablend.pas(683,13) Note: (6058) Call to subroutine "procedure DrawPixelInlineWithAlphaCheck(dest:PBGRAPixel;c:TBGRAPixel;appliedOpacity:Byte);" marked as inline is not inlined
/builddir/build/BUILD/bgrabitmap-10.8.1/bgrabitmap/bgrablend.pas(721,11) Note: (6058) Call to subroutine "procedure FastBlendPixelInline(dest:PBGRAPixel;const c:TBGRAPixel);" marked as inline is not inlined
/builddir/build/BUILD/bgrabitmap-10.8.1/bgrabitmap/bgrablend.pas(733,11) Note: (6058) Call to subroutine "procedure FastBlendPixelInline(dest:PBGRAPixel;c:TBGRAPixel;appliedOpacity:Byte);" marked as inline is not inlined
/builddir/build/BUILD/bgrabitmap-10.8.1/bgrabitmap/bgrablend.pas(734,11) Note: (6058) Call to subroutine "procedure FastBlendPixelInline(dest:PBGRAPixel;c:TBGRAPixel;appliedOpacity:Byte);" marked as inline is not inlined
/builddir/build/BUILD/bgrabitmap-10.8.1/bgrabitmap/bgrablend.pas(735,11) Note: (6058) Call to subroutine "procedure FastBlendPixelInline(dest:PBGRAPixel;c:TBGRAPixel;appliedOpacity:Byte);" marked as inline is not inlined
/builddir/build/BUILD/bgrabitmap-10.8.1/bgrabitmap/bgrablend.pas(736,11) Note: (6058) Call to subroutine "procedure FastBlendPixelInline(dest:PBGRAPixel;c:TBGRAPixel;appliedOpacity:Byte);" marked as inline is not inlined
/builddir/build/BUILD/bgrabitmap-10.8.1/bgrabitmap/bgrablend.pas(744,9) Note: (6058) Call to subroutine "procedure FastBlendPixelInline(dest:PBGRAPixel;c:TBGRAPixel;appliedOpacity:Byte);" marked as inline is not inlined
/builddir/build/BUILD/bgrabitmap-10.8.1/bgrabitmap/bgrablend.pas(732,50) Warning: (5036) Local variable "buf" does not seem to be initialized
/builddir/build/BUILD/bgrabitmap-10.8.1/bgrabitmap/bgrablend.pas(783,13) Note: (6058) Call to subroutine "procedure FastBlendPixelInline(dest:PBGRAPixel;const c:TBGRAPixel);" marked as inline is not inlined
/builddir/build/BUILD/bgrabitmap-10.8.1/bgrabitmap/bgrablend.pas(801,13) Note: (6058) Call to subroutine "procedure FastBlendPixelInline(dest:PBGRAPixel;c:TBGRAPixel;appliedOpacity:Byte);" marked as inline is not inlined
/builddir/build/BUILD/bgrabitmap-10.8.1/bgrabitmap/bgrablend.pas(850,50) Warning: (5036) Local variable "buf" does not seem to be initialized
/builddir/build/BUILD/bgrabitmap-10.8.1/bgrabitmap/bgrablend.pas(991,5) Note: (6058) Call to subroutine "procedure ErasePixelInline(dest:PBGRAPixel;alpha:Byte);" marked as inline is not inlined
/builddir/build/BUILD/bgrabitmap-10.8.1/bgrabitmap/bgrablend.pas(1024,27) Note: (6058) Call to subroutine "function ApplyOpacity(opacity1:Byte;opacity2:Byte):Byte;" marked as inline is not inlined
/builddir/build/BUILD/bgrabitmap-10.8.1/bgrabitmap/bgrablend.pas(1041,27) Note: (6058) Call to subroutine "function ApplyOpacity(opacity1:Byte;opacity2:Byte):Byte;" marked as inline is not inlined
/builddir/build/BUILD/bgrabitmap-10.8.1/bgrabitmap/bgrablend.pas(1041,87) Note: (6058) Call to subroutine "function ApplyOpacity(opacity1:Byte;opacity2:Byte):Byte;" marked as inline is not inlined
/builddir/build/BUILD/bgrabitmap-10.8.1/bgrabitmap/bgrablend.pas(1099,5) Note: (6058) Call to subroutine "procedure AlphaFillInline(dest:PBGRAPixel;alpha:Byte;Count:LongInt);" marked as inline is not inlined
/builddir/build/BUILD/bgrabitmap-10.8.1/bgrabitmap/bgrablend.pas(1261,9) Note: (6058) Call to subroutine "procedure ClearTypeDrawPixel(pdest:PBGRAPixel;Cr:Byte;Cg:Byte;Cb:Byte;Color:TBGRAPixel);" marked as inline is not inlined
/builddir/build/BUILD/bgrabitmap-10.8.1/bgrabitmap/bgrablend.pas(1261,9) Note: (6058) Call to subroutine "procedure ClearTypeDrawPixel(pdest:PBGRAPixel;Cr:Byte;Cg:Byte;Cb:Byte;Color:TBGRAPixel);" marked as inline is not inlined
/builddir/build/BUILD/bgrabitmap-10.8.1/bgrabitmap/bgrablend.pas(1274,7) Note: (6058) Call to subroutine "procedure ClearTypeDrawPixel(pdest:PBGRAPixel;Cr:Byte;Cg:Byte;Cb:Byte;Color:TBGRAPixel);" marked as inline is not inlined
/builddir/build/BUILD/bgrabitmap-10.8.1/bgrabitmap/bgrablend.pas(1274,7) Note: (6058) Call to subroutine "procedure ClearTypeDrawPixel(pdest:PBGRAPixel;Cr:Byte;Cg:Byte;Cb:Byte;Color:TBGRAPixel);" marked as inline is not inlined
/builddir/build/BUILD/bgrabitmap-10.8.1/bgrabitmap/bgrablend.pas(1275,7) Note: (6058) Call to subroutine "procedure ClearTypeDrawPixel(pdest:PBGRAPixel;Cr:Byte;Cg:Byte;Cb:Byte;Color:TBGRAPixel);" marked as inline is not inlined
/builddir/build/BUILD/bgrabitmap-10.8.1/bgrabitmap/bgrablend.pas(1275,7) Note: (6058) Call to subroutine "procedure ClearTypeDrawPixel(pdest:PBGRAPixel;Cr:Byte;Cg:Byte;Cb:Byte;Color:TBGRAPixel);" marked as inline is not inlined
/builddir/build/BUILD/bgrabitmap-10.8.1/bgrabitmap/bgrablend.pas(1277,7) Note: (6058) Call to subroutine "procedure ClearTypeDrawPixel(pdest:PBGRAPixel;Cr:Byte;Cg:Byte;Cb:Byte;Color:TBGRAPixel);" marked as inline is not inlined
/builddir/build/BUILD/bgrabitmap-10.8.1/bgrabitmap/bgrablend.pas(1277,7) Note: (6058) Call to subroutine "procedure ClearTypeDrawPixel(pdest:PBGRAPixel;Cr:Byte;Cg:Byte;Cb:Byte;Color:TBGRAPixel);" marked as inline is not inlined
/builddir/build/BUILD/bgrabitmap-10.8.1/bgrabitmap/bgrablend.pas(1235,7) Warning: (5036) Local variable "minxThird" does not seem to be initialized
/builddir/build/BUILD/bgrabitmap-10.8.1/bgrabitmap/bgrablend.pas(1235,7) Warning: (5036) Local variable "minx" does not seem to be initialized
/builddir/build/BUILD/bgrabitmap-10.8.1/bgrabitmap/bgrablend.pas(1162,26) Note: (6058) Call to subroutine "procedure ClearTypeDrawPixel(pdest:PBGRAPixel;Cr:Byte;Cg:Byte;Cb:Byte;Color:TBGRAPixel);" marked as inline is not inlined
/builddir/build/BUILD/bgrabitmap-10.8.1/bgrabitmap/bgrablend.pas(1162,26) Note: (6058) Call to subroutine "procedure ClearTypeDrawPixel(pdest:PBGRAPixel;Cr:Byte;Cg:Byte;Cb:Byte;Color:TBGRAPixel);" marked as inline is not inlined
/builddir/build/BUILD/bgrabitmap-10.8.1/bgrabitmap/bgrablend.pas(1153,7) Note: (6058) Call to subroutine "procedure ClearTypeDrawPixel(pdest:PBGRAPixel;Cr:Byte;Cg:Byte;Cb:Byte;Color:TBGRAPixel);" marked as inline is not inlined
/builddir/build/BUILD/bgrabitmap-10.8.1/bgrabitmap/bgrablend.pas(1153,7) Note: (6058) Call to subroutine "procedure ClearTypeDrawPixel(pdest:PBGRAPixel;Cr:Byte;Cg:Byte;Cb:Byte;Color:TBGRAPixel);" marked as inline is not inlined
/builddir/build/BUILD/bgrabitmap-10.8.1/bgrabitmap/bgrablend.pas(1142,7) Note: (6058) Call to subroutine "procedure ClearTypeDrawPixel(pdest:PBGRAPixel;Cr:Byte;Cg:Byte;Cb:Byte;Color:TBGRAPixel);" marked as inline is not inlined
/builddir/build/BUILD/bgrabitmap-10.8.1/bgrabitmap/bgrablend.pas(1144,7) Note: (6058) Call to subroutine "procedure ClearTypeDrawPixel(pdest:PBGRAPixel;Cr:Byte;Cg:Byte;Cb:Byte;Color:TBGRAPixel);" marked as inline is not inlined
/builddir/build/BUILD/bgrabitmap-10.8.1/bgrabitmap/bgrablend.pas(1324,9) Note: (6058) Call to subroutine "procedure ClearTypeDrawPixel(pdest:PBGRAPixel;Cr:Byte;Cg:Byte;Cb:Byte;Color:TBGRAPixel);" marked as inline is not inlined
/builddir/build/BUILD/bgrabitmap-10.8.1/bgrabitmap/bgrablend.pas(1333,9) Note: (6058) Call to subroutine "procedure ClearTypeDrawPixel(pdest:PBGRAPixel;Cr:Byte;Cg:Byte;Cb:Byte;Color:TBGRAPixel);" marked as inline is not inlined
/builddir/build/BUILD/bgrabitmap-10.8.1/bgrabitmap/bgrablend.pas(1346,9) Note: (6058) Call to subroutine "function ApplyOpacity(opacity1:Byte;opacity2:Byte):Byte;" marked as inline is not inlined
/builddir/build/BUILD/bgrabitmap-10.8.1/bgrabitmap/bgrablend.pas(1347,9) Note: (6058) Call to subroutine "function ApplyOpacity(opacity1:Byte;opacity2:Byte):Byte;" marked as inline is not inlined
/builddir/build/BUILD/bgrabitmap-10.8.1/bgrabitmap/bgrablend.pas(1348,9) Note: (6058) Call to subroutine "function ApplyOpacity(opacity1:Byte;opacity2:Byte):Byte;" marked as inline is not inlined
/builddir/build/BUILD/bgrabitmap-10.8.1/bgrabitmap/bgrablend.pas(1366,7) Note: (6058) Call to subroutine "procedure DrawPixelInlineWithAlphaCheck(dest:PBGRAPixel;c:TBGRAPixel;appliedOpacity:Byte);" marked as inline is not inlined
/builddir/build/BUILD/bgrabitmap-10.8.1/bgrabitmap/bgrablend.pas(1374,45) Note: (6058) Call to subroutine "function ApplyOpacity(opacity1:Byte;opacity2:Byte):Byte;" marked as inline is not inlined
/builddir/build/BUILD/bgrabitmap-10.8.1/bgrabitmap/bgrablend.pas(1488,11) Note: (6058) Call to subroutine "procedure FastBlendPixelInline(dest:PBGRAPixel;const c:TBGRAPixel);" marked as inline is not inlined
/builddir/build/BUILD/bgrabitmap-10.8.1/bgrabitmap/bgrablend.pas(1494,11) Note: (6058) Call to subroutine "procedure DrawPixelInlineWithAlphaCheck(dest:PBGRAPixel;const c:TBGRAPixel);" marked as inline is not inlined
/builddir/build/BUILD/bgrabitmap-10.8.1/bgrabitmap/blendpixels.inc(5,9) Note: (6058) Call to subroutine "procedure FastBlendPixelInline(dest:PBGRAPixel;const c:TBGRAPixel);" marked as inline is not inlined
/builddir/build/BUILD/bgrabitmap-10.8.1/bgrabitmap/blendpixels.inc(16,11) Note: (6058) Call to subroutine "procedure DrawPixelInlineWithAlphaCheck(dest:PBGRAPixel;const c:TBGRAPixel);" marked as inline is not inlined
/builddir/build/BUILD/bgrabitmap-10.8.1/bgrabitmap/blendpixels.inc(27,11) Note: (6058) Call to subroutine "procedure LinearMultiplyPixelInline(dest:PBGRAPixel;c:TBGRAPixel);" marked as inline is not inlined
/builddir/build/BUILD/bgrabitmap-10.8.1/bgrabitmap/blendpixels.inc(38,11) Note: (6058) Call to subroutine "procedure AddPixelInline(dest:PBGRAPixel;c:TBGRAPixel);" marked as inline is not inlined
/builddir/build/BUILD/bgrabitmap-10.8.1/bgrabitmap/blendpixels.inc(49,11) Note: (6058) Call to subroutine "procedure LinearAddPixelInline(dest:PBGRAPixel;c:TBGRAPixel);" marked as inline is not inlined
/builddir/build/BUILD/bgrabitmap-10.8.1/bgrabitmap/blendpixels.inc(60,9) Note: (6058) Call to subroutine "procedure ColorBurnPixelInline(dest:PBGRAPixel;c:TBGRAPixel);" marked as inline is not inlined
/builddir/build/BUILD/bgrabitmap-10.8.1/bgrabitmap/blendpixels.inc(71,11) Note: (6058) Call to subroutine "procedure ColorDodgePixelInline(dest:PBGRAPixel;c:TBGRAPixel);" marked as inline is not inlined
/builddir/build/BUILD/bgrabitmap-10.8.1/bgrabitmap/blendpixels.inc(82,9) Note: (6058) Call to subroutine "procedure DividePixelInline(dest:PBGRAPixel;c:TBGRAPixel);" marked as inline is not inlined
/builddir/build/BUILD/bgrabitmap-10.8.1/bgrabitmap/blendpixels.inc(93,11) Note: (6058) Call to subroutine "procedure ReflectPixelInline(dest:PBGRAPixel;c:TBGRAPixel);" marked as inline is not inlined
/builddir/build/BUILD/bgrabitmap-10.8.1/bgrabitmap/blendpixels.inc(104,11) Note: (6058) Call to subroutine "procedure GlowPixelInline(dest:PBGRAPixel;c:TBGRAPixel);" marked as inline is not inlined
/builddir/build/BUILD/bgrabitmap-10.8.1/bgrabitmap/blendpixels.inc(115,11) Note: (6058) Call to subroutine "procedure NiceGlowPixelInline(dest:PBGRAPixel;c:TBGRAPixel);" marked as inline is not inlined
/builddir/build/BUILD/bgrabitmap-10.8.1/bgrabitmap/blendpixels.inc(126,11) Note: (6058) Call to subroutine "procedure OverlayPixelInline(dest:PBGRAPixel;c:TBGRAPixel);" marked as inline is not inlined
/builddir/build/BUILD/bgrabitmap-10.8.1/bgrabitmap/blendpixels.inc(137,11) Note: (6058) Call to subroutine "procedure LinearOverlayPixelInline(dest:PBGRAPixel;c:TBGRAPixel);" marked as inline is not inlined
/builddir/build/BUILD/bgrabitmap-10.8.1/bgrabitmap/blendpixels.inc(148,11) Note: (6058) Call to subroutine "procedure DifferencePixelInline(dest:PBGRAPixel;c:TBGRAPixel);" marked as inline is not inlined
/builddir/build/BUILD/bgrabitmap-10.8.1/bgrabitmap/blendpixels.inc(159,11) Note: (6058) Call to subroutine "procedure LinearDifferencePixelInline(dest:PBGRAPixel;c:TBGRAPixel);" marked as inline is not inlined
/builddir/build/BUILD/bgrabitmap-10.8.1/bgrabitmap/blendpixels.inc(170,9) Note: (6058) Call to subroutine "procedure ExclusionPixelInline(dest:PBGRAPixel;c:TBGRAPixel);" marked as inline is not inlined
/builddir/build/BUILD/bgrabitmap-10.8.1/bgrabitmap/blendpixels.inc(181,11) Note: (6058) Call to subroutine "procedure LinearExclusionPixelInline(dest:PBGRAPixel;c:TBGRAPixel);" marked as inline is not inlined
/builddir/build/BUILD/bgrabitmap-10.8.1/bgrabitmap/blendpixels.inc(192,11) Note: (6058) Call to subroutine "procedure LinearSubtractPixelInline(dest:PBGRAPixel;c:TBGRAPixel);" marked as inline is not inlined
/builddir/build/BUILD/bgrabitmap-10.8.1/bgrabitmap/blendpixels.inc(203,11) Note: (6058) Call to subroutine "procedure LinearSubtractInversePixelInline(dest:PBGRAPixel;c:TBGRAPixel);" marked as inline is not inlined
/builddir/build/BUILD/bgrabitmap-10.8.1/bgrabitmap/blendpixels.inc(214,11) Note: (6058) Call to subroutine "procedure SubtractPixelInline(dest:PBGRAPixel;c:TBGRAPixel);" marked as inline is not inlined
/builddir/build/BUILD/bgrabitmap-10.8.1/bgrabitmap/blendpixels.inc(225,11) Note: (6058) Call to subroutine "procedure SubtractInversePixelInline(dest:PBGRAPixel;c:TBGRAPixel);" marked as inline is not inlined
/builddir/build/BUILD/bgrabitmap-10.8.1/bgrabitmap/blendpixels.inc(236,11) Note: (6058) Call to subroutine "procedure NegationPixelInline(dest:PBGRAPixel;c:TBGRAPixel);" marked as inline is not inlined
/builddir/build/BUILD/bgrabitmap-10.8.1/bgrabitmap/blendpixels.inc(247,11) Note: (6058) Call to subroutine "procedure LinearNegationPixelInline(dest:PBGRAPixel;c:TBGRAPixel);" marked as inline is not inlined
/builddir/build/BUILD/bgrabitmap-10.8.1/bgrabitmap/blendpixels.inc(258,11) Note: (6058) Call to subroutine "procedure LightenPixelInline(dest:PBGRAPixel;c:TBGRAPixel);" marked as inline is not inlined
/builddir/build/BUILD/bgrabitmap-10.8.1/bgrabitmap/blendpixels.inc(269,11) Note: (6058) Call to subroutine "procedure DarkenPixelInline(dest:PBGRAPixel;c:TBGRAPixel);" marked as inline is not inlined
/builddir/build/BUILD/bgrabitmap-10.8.1/bgrabitmap/blendpixels.inc(280,9) Note: (6058) Call to subroutine "procedure ScreenPixelInline(dest:PBGRAPixel;c:TBGRAPixel);" marked as inline is not inlined
/builddir/build/BUILD/bgrabitmap-10.8.1/bgrabitmap/blendpixels.inc(291,11) Note: (6058) Call to subroutine "procedure SoftLightPixelInline(dest:PBGRAPixel;c:TBGRAPixel);" marked as inline is not inlined
/builddir/build/BUILD/bgrabitmap-10.8.1/bgrabitmap/blendpixels.inc(302,11) Note: (6058) Call to subroutine "procedure SvgSoftLightPixelInline(dest:PBGRAPixel;c:TBGRAPixel);" marked as inline is not inlined
/builddir/build/BUILD/bgrabitmap-10.8.1/bgrabitmap/blendpixels.inc(313,11) Note: (6058) Call to subroutine "procedure HardLightPixelInline(dest:PBGRAPixel;c:TBGRAPixel);" marked as inline is not inlined
/builddir/build/BUILD/bgrabitmap-10.8.1/bgrabitmap/blendpixels.inc(324,11) Note: (6058) Call to subroutine "procedure BlendXorPixelInline(dest:PBGRAPixel;c:TBGRAPixel);" marked as inline is not inlined
/builddir/build/BUILD/bgrabitmap-10.8.1/bgrabitmap/blendpixels.inc(335,11) Note: (6058) Call to subroutine "procedure BlendMaskPixelInline(dest:PBGRAPixel;c:TBGRAPixel);" marked as inline is not inlined
/builddir/build/BUILD/bgrabitmap-10.8.1/bgrabitmap/blendpixels.inc(346,11) Note: (6058) Call to subroutine "procedure LinearMultiplySaturationInline(dest:PBGRAPixel;c:TBGRAPixel);" marked as inline is not inlined
/builddir/build/BUILD/bgrabitmap-10.8.1/bgrabitmap/bgrablend.pas(1565,5) Note: (6058) Call to subroutine "procedure FastBlendPixelInline(dest:PBGRAPixel;const c:TBGRAPixel);" marked as inline is not inlined
/builddir/build/BUILD/bgrabitmap-10.8.1/bgrabitmap/bgrablend.pas(1578,11) Note: (6058) Call to subroutine "procedure CopyPixelsWithOpacity(dest:PBGRAPixel;src:PBGRAPixel;opacity:Byte;Count:LongInt);" marked as inline is not inlined
/builddir/build/BUILD/bgrabitmap-10.8.1/bgrabitmap/bgrablend.pas(1594,34) Note: (6058) Call to subroutine "function ApplyOpacity(opacity1:Byte;opacity2:Byte):Byte;" marked as inline is not inlined
/builddir/build/BUILD/bgrabitmap-10.8.1/bgrabitmap/bgrablend.pas(1595,15) Note: (6058) Call to subroutine "procedure FastBlendPixelInline(dest:PBGRAPixel;const c:TBGRAPixel);" marked as inline is not inlined
/builddir/build/BUILD/bgrabitmap-10.8.1/bgrabitmap/bgrablend.pas(1615,13) Note: (6058) Call to subroutine "procedure DrawPixelInlineWithAlphaCheck(dest:PBGRAPixel;c:TBGRAPixel;appliedOpacity:Byte);" marked as inline is not inlined
/builddir/build/BUILD/bgrabitmap-10.8.1/bgrabitmap/bgrablend.pas(1623,13) Note: (6058) Call to subroutine "procedure DrawPixelInlineWithAlphaCheck(dest:PBGRAPixel;const c:TBGRAPixel);" marked as inline is not inlined
/builddir/build/BUILD/bgrabitmap-10.8.1/bgrabitmap/bgrablend.pas(1634,13) Note: (6058) Call to subroutine "procedure FastBlendPixelInline(dest:PBGRAPixel;c:TBGRAPixel;appliedOpacity:Byte);" marked as inline is not inlined
/builddir/build/BUILD/bgrabitmap-10.8.1/bgrabitmap/bgrablend.pas(1641,13) Note: (6058) Call to subroutine "procedure FastBlendPixelInline(dest:PBGRAPixel;const c:TBGRAPixel);" marked as inline is not inlined
/builddir/build/BUILD/bgrabitmap-10.8.1/bgrabitmap/bgrablend.pas(1652,13) Note: (6058) Call to subroutine "procedure FastBlendPixelInline(dest:PBGRAPixel;c:TBGRAPixel;appliedOpacity:Byte);" marked as inline is not inlined
/builddir/build/BUILD/bgrabitmap-10.8.1/bgrabitmap/bgrablend.pas(1676,5) Note: (6058) Call to subroutine "procedure DrawExpandedPixelInlineNoAlphaCheck(dest:PBGRAPixel;const ec:TExpandedPixel;calpha:Byte);" marked as inline is not inlined
/builddir/build/BUILD/bgrabitmap-10.8.1/bgrabitmap/bgrablend.pas(1696,5) Note: (6058) Call to subroutine "procedure DrawExpandedPixelInlineNoAlphaCheck(dest:PBGRAPixel;const ec:TExpandedPixel;calpha:Byte);" marked as inline is not inlined
/builddir/build/BUILD/bgrabitmap-10.8.1/bgrabitmap/bgrablend.pas(1713,5) Note: (6058) Call to subroutine "procedure DrawExpandedPixelInlineNoAlphaCheck(dest:PBGRAPixel;const ec:TExpandedPixel;calpha:Byte);" marked as inline is not inlined
/builddir/build/BUILD/bgrabitmap-10.8.1/bgrabitmap/bgrablend.pas(1725,5) Note: (6058) Call to subroutine "procedure DrawPixelInlineDiff(dest:PBGRAPixel;c:TBGRAPixel;compare:TBGRAPixel;maxDiff:Byte);" marked as inline is not inlined
/builddir/build/BUILD/bgrabitmap-10.8.1/bgrabitmap/bgrablend.pas(1736,5) Note: (6058) Call to subroutine "procedure DrawPixelInlineNoAlphaCheck(dest:PBGRAPixel;const c:TBGRAPixel);" marked as inline is not inlined
/builddir/build/BUILD/bgrabitmap-10.8.1/bgrabitmap/bgrablend.pas(1742,14) Note: (6058) Call to subroutine "function ApplyOpacity(opacity1:Byte;opacity2:Byte):Byte;" marked as inline is not inlined
/builddir/build/BUILD/bgrabitmap-10.8.1/bgrabitmap/bgrablend.pas(1743,3) Note: (6058) Call to subroutine "procedure DrawPixelInlineNoAlphaCheck(dest:PBGRAPixel;const c:TBGRAPixel);" marked as inline is not inlined
/builddir/build/BUILD/bgrabitmap-10.8.1/bgrabitmap/bgrablend.pas(1777,5) Note: (6058) Call to subroutine "procedure DrawExpandedPixelInlineNoAlphaCheck(dest:PBGRAPixel;const ec:TExpandedPixel;calpha:Byte);" marked as inline is not inlined
/builddir/build/BUILD/bgrabitmap-10.8.1/bgrabitmap/bgrablend.pas(1787,5) Note: (6058) Call to subroutine "procedure DrawExpandedPixelInlineNoAlphaCheck(dest:PBGRAPixel;const ec:TExpandedPixel;calpha:Byte);" marked as inline is not inlined
/builddir/build/BUILD/bgrabitmap-10.8.1/bgrabitmap/bgrablend.pas(1920,5) Note: (6058) Call to subroutine "procedure DrawPixelInlineNoAlphaCheck(dest:PBGRAPixel;const c:TBGRAPixel);" marked as inline is not inlined
/builddir/build/BUILD/bgrabitmap-10.8.1/bgrabitmap/blendpixelsover.inc(7,11) Note: (6058) Call to subroutine "procedure FastBlendPixelInline(dest:PBGRAPixel;const c:TBGRAPixel);" marked as inline is not inlined
/builddir/build/BUILD/bgrabitmap-10.8.1/bgrabitmap/blendpixelsover.inc(18,11) Note: (6058) Call to subroutine "procedure DrawPixelInlineNoAlphaCheck(dest:PBGRAPixel;const c:TBGRAPixel);" marked as inline is not inlined
/builddir/build/BUILD/bgrabitmap-10.8.1/bgrabitmap/blendpixelsover.inc(31,11) Note: (6058) Call to subroutine "procedure LinearMultiplyPixelInline(dest:PBGRAPixel;c:TBGRAPixel);" marked as inline is not inlined
/builddir/build/BUILD/bgrabitmap-10.8.1/bgrabitmap/blendpixelsover.inc(32,11) Note: (6058) Call to subroutine "procedure FastBlendPixelInline(dest:PBGRAPixel;const c:TBGRAPixel);" marked as inline is not inlined
/builddir/build/BUILD/bgrabitmap-10.8.1/bgrabitmap/blendpixelsover.inc(45,11) Note: (6058) Call to subroutine "procedure LinearMultiplyPixelInline(dest:PBGRAPixel;c:TBGRAPixel);" marked as inline is not inlined
/builddir/build/BUILD/bgrabitmap-10.8.1/bgrabitmap/blendpixelsover.inc(46,11) Note: (6058) Call to subroutine "procedure DrawPixelInlineNoAlphaCheck(dest:PBGRAPixel;const c:TBGRAPixel);" marked as inline is not inlined
/builddir/build/BUILD/bgrabitmap-10.8.1/bgrabitmap/blendpixelsover.inc(59,11) Note: (6058) Call to subroutine "procedure AddPixelInline(dest:PBGRAPixel;c:TBGRAPixel);" marked as inline is not inlined
/builddir/build/BUILD/bgrabitmap-10.8.1/bgrabitmap/blendpixelsover.inc(60,11) Note: (6058) Call to subroutine "procedure FastBlendPixelInline(dest:PBGRAPixel;const c:TBGRAPixel);" marked as inline is not inlined
/builddir/build/BUILD/bgrabitmap-10.8.1/bgrabitmap/blendpixelsover.inc(73,11) Note: (6058) Call to subroutine "procedure AddPixelInline(dest:PBGRAPixel;c:TBGRAPixel);" marked as inline is not inlined
/builddir/build/BUILD/bgrabitmap-10.8.1/bgrabitmap/blendpixelsover.inc(74,11) Note: (6058) Call to subroutine "procedure DrawPixelInlineNoAlphaCheck(dest:PBGRAPixel;const c:TBGRAPixel);" marked as inline is not inlined
/builddir/build/BUILD/bgrabitmap-10.8.1/bgrabitmap/blendpixelsover.inc(87,11) Note: (6058) Call to subroutine "procedure LinearAddPixelInline(dest:PBGRAPixel;c:TBGRAPixel);" marked as inline is not inlined
/builddir/build/BUILD/bgrabitmap-10.8.1/bgrabitmap/blendpixelsover.inc(88,11) Note: (6058) Call to subroutine "procedure FastBlendPixelInline(dest:PBGRAPixel;const c:TBGRAPixel);" marked as inline is not inlined
/builddir/build/BUILD/bgrabitmap-10.8.1/bgrabitmap/blendpixelsover.inc(101,11) Note: (6058) Call to subroutine "procedure LinearAddPixelInline(dest:PBGRAPixel;c:TBGRAPixel);" marked as inline is not inlined
/builddir/build/BUILD/bgrabitmap-10.8.1/bgrabitmap/blendpixelsover.inc(102,11) Note: (6058) Call to subroutine "procedure DrawPixelInlineNoAlphaCheck(dest:PBGRAPixel;const c:TBGRAPixel);" marked as inline is not inlined
/builddir/build/BUILD/bgrabitmap-10.8.1/bgrabitmap/blendpixelsover.inc(115,11) Note: (6058) Call to subroutine "procedure ColorBurnPixelInline(dest:PBGRAPixel;c:TBGRAPixel);" marked as inline is not inlined
/builddir/build/BUILD/bgrabitmap-10.8.1/bgrabitmap/blendpixelsover.inc(116,11) Note: (6058) Call to subroutine "procedure FastBlendPixelInline(dest:PBGRAPixel;const c:TBGRAPixel);" marked as inline is not inlined
/builddir/build/BUILD/bgrabitmap-10.8.1/bgrabitmap/blendpixelsover.inc(129,11) Note: (6058) Call to subroutine "procedure ColorBurnPixelInline(dest:PBGRAPixel;c:TBGRAPixel);" marked as inline is not inlined
/builddir/build/BUILD/bgrabitmap-10.8.1/bgrabitmap/blendpixelsover.inc(130,11) Note: (6058) Call to subroutine "procedure DrawPixelInlineNoAlphaCheck(dest:PBGRAPixel;const c:TBGRAPixel);" marked as inline is not inlined
/builddir/build/BUILD/bgrabitmap-10.8.1/bgrabitmap/blendpixelsover.inc(143,11) Note: (6058) Call to subroutine "procedure ColorDodgePixelInline(dest:PBGRAPixel;c:TBGRAPixel);" marked as inline is not inlined
/builddir/build/BUILD/bgrabitmap-10.8.1/bgrabitmap/blendpixelsover.inc(144,11) Note: (6058) Call to subroutine "procedure FastBlendPixelInline(dest:PBGRAPixel;const c:TBGRAPixel);" marked as inline is not inlined
/builddir/build/BUILD/bgrabitmap-10.8.1/bgrabitmap/blendpixelsover.inc(157,11) Note: (6058) Call to subroutine "procedure ColorDodgePixelInline(dest:PBGRAPixel;c:TBGRAPixel);" marked as inline is not inlined
/builddir/build/BUILD/bgrabitmap-10.8.1/bgrabitmap/blendpixelsover.inc(158,11) Note: (6058) Call to subroutine "procedure DrawPixelInlineNoAlphaCheck(dest:PBGRAPixel;const c:TBGRAPixel);" marked as inline is not inlined
/builddir/build/BUILD/bgrabitmap-10.8.1/bgrabitmap/blendpixelsover.inc(171,11) Note: (6058) Call to subroutine "procedure DividePixelInline(dest:PBGRAPixel;c:TBGRAPixel);" marked as inline is not inlined
/builddir/build/BUILD/bgrabitmap-10.8.1/bgrabitmap/blendpixelsover.inc(172,11) Note: (6058) Call to subroutine "procedure FastBlendPixelInline(dest:PBGRAPixel;const c:TBGRAPixel);" marked as inline is not inlined
/builddir/build/BUILD/bgrabitmap-10.8.1/bgrabitmap/blendpixelsover.inc(185,11) Note: (6058) Call to subroutine "procedure DividePixelInline(dest:PBGRAPixel;c:TBGRAPixel);" marked as inline is not inlined
/builddir/build/BUILD/bgrabitmap-10.8.1/bgrabitmap/blendpixelsover.inc(186,11) Note: (6058) Call to subroutine "procedure DrawPixelInlineNoAlphaCheck(dest:PBGRAPixel;const c:TBGRAPixel);" marked as inline is not inlined
/builddir/build/BUILD/bgrabitmap-10.8.1/bgrabitmap/blendpixelsover.inc(199,11) Note: (6058) Call to subroutine "procedure ReflectPixelInline(dest:PBGRAPixel;c:TBGRAPixel);" marked as inline is not inlined
/builddir/build/BUILD/bgrabitmap-10.8.1/bgrabitmap/blendpixelsover.inc(200,11) Note: (6058) Call to subroutine "procedure FastBlendPixelInline(dest:PBGRAPixel;const c:TBGRAPixel);" marked as inline is not inlined
/builddir/build/BUILD/bgrabitmap-10.8.1/bgrabitmap/blendpixelsover.inc(213,11) Note: (6058) Call to subroutine "procedure ReflectPixelInline(dest:PBGRAPixel;c:TBGRAPixel);" marked as inline is not inlined
/builddir/build/BUILD/bgrabitmap-10.8.1/bgrabitmap/blendpixelsover.inc(214,11) Note: (6058) Call to subroutine "procedure DrawPixelInlineNoAlphaCheck(dest:PBGRAPixel;const c:TBGRAPixel);" marked as inline is not inlined
/builddir/build/BUILD/bgrabitmap-10.8.1/bgrabitmap/blendpixelsover.inc(227,11) Note: (6058) Call to subroutine "procedure GlowPixelInline(dest:PBGRAPixel;c:TBGRAPixel);" marked as inline is not inlined
/builddir/build/BUILD/bgrabitmap-10.8.1/bgrabitmap/blendpixelsover.inc(228,11) Note: (6058) Call to subroutine "procedure FastBlendPixelInline(dest:PBGRAPixel;const c:TBGRAPixel);" marked as inline is not inlined
/builddir/build/BUILD/bgrabitmap-10.8.1/bgrabitmap/blendpixelsover.inc(241,11) Note: (6058) Call to subroutine "procedure GlowPixelInline(dest:PBGRAPixel;c:TBGRAPixel);" marked as inline is not inlined
/builddir/build/BUILD/bgrabitmap-10.8.1/bgrabitmap/blendpixelsover.inc(242,11) Note: (6058) Call to subroutine "procedure DrawPixelInlineNoAlphaCheck(dest:PBGRAPixel;const c:TBGRAPixel);" marked as inline is not inlined
/builddir/build/BUILD/bgrabitmap-10.8.1/bgrabitmap/blendpixelsover.inc(255,11) Note: (6058) Call to subroutine "procedure NiceGlowPixelInline(dest:PBGRAPixel;c:TBGRAPixel);" marked as inline is not inlined
/builddir/build/BUILD/bgrabitmap-10.8.1/bgrabitmap/blendpixelsover.inc(256,11) Note: (6058) Call to subroutine "procedure FastBlendPixelInline(dest:PBGRAPixel;const c:TBGRAPixel);" marked as inline is not inlined
/builddir/build/BUILD/bgrabitmap-10.8.1/bgrabitmap/blendpixelsover.inc(269,11) Note: (6058) Call to subroutine "procedure NiceGlowPixelInline(dest:PBGRAPixel;c:TBGRAPixel);" marked as inline is not inlined
/builddir/build/BUILD/bgrabitmap-10.8.1/bgrabitmap/blendpixelsover.inc(270,11) Note: (6058) Call to subroutine "procedure DrawPixelInlineNoAlphaCheck(dest:PBGRAPixel;const c:TBGRAPixel);" marked as inline is not inlined
/builddir/build/BUILD/bgrabitmap-10.8.1/bgrabitmap/blendpixelsover.inc(283,11) Note: (6058) Call to subroutine "procedure OverlayPixelInline(dest:PBGRAPixel;c:TBGRAPixel);" marked as inline is not inlined
/builddir/build/BUILD/bgrabitmap-10.8.1/bgrabitmap/blendpixelsover.inc(284,11) Note: (6058) Call to subroutine "procedure FastBlendPixelInline(dest:PBGRAPixel;const c:TBGRAPixel);" marked as inline is not inlined
/builddir/build/BUILD/bgrabitmap-10.8.1/bgrabitmap/blendpixelsover.inc(297,11) Note: (6058) Call to subroutine "procedure OverlayPixelInline(dest:PBGRAPixel;c:TBGRAPixel);" marked as inline is not inlined
/builddir/build/BUILD/bgrabitmap-10.8.1/bgrabitmap/blendpixelsover.inc(298,11) Note: (6058) Call to subroutine "procedure DrawPixelInlineNoAlphaCheck(dest:PBGRAPixel;const c:TBGRAPixel);" marked as inline is not inlined
/builddir/build/BUILD/bgrabitmap-10.8.1/bgrabitmap/blendpixelsover.inc(311,11) Note: (6058) Call to subroutine "procedure LinearOverlayPixelInline(dest:PBGRAPixel;c:TBGRAPixel);" marked as inline is not inlined
/builddir/build/BUILD/bgrabitmap-10.8.1/bgrabitmap/blendpixelsover.inc(312,11) Note: (6058) Call to subroutine "procedure FastBlendPixelInline(dest:PBGRAPixel;const c:TBGRAPixel);" marked as inline is not inlined
/builddir/build/BUILD/bgrabitmap-10.8.1/bgrabitmap/blendpixelsover.inc(325,11) Note: (6058) Call to subroutine "procedure LinearOverlayPixelInline(dest:PBGRAPixel;c:TBGRAPixel);" marked as inline is not inlined
/builddir/build/BUILD/bgrabitmap-10.8.1/bgrabitmap/blendpixelsover.inc(326,11) Note: (6058) Call to subroutine "procedure DrawPixelInlineNoAlphaCheck(dest:PBGRAPixel;const c:TBGRAPixel);" marked as inline is not inlined
/builddir/build/BUILD/bgrabitmap-10.8.1/bgrabitmap/blendpixelsover.inc(339,11) Note: (6058) Call to subroutine "procedure DifferencePixelInline(dest:PBGRAPixel;c:TBGRAPixel);" marked as inline is not inlined
/builddir/build/BUILD/bgrabitmap-10.8.1/bgrabitmap/blendpixelsover.inc(340,11) Note: (6058) Call to subroutine "procedure FastBlendPixelInline(dest:PBGRAPixel;const c:TBGRAPixel);" marked as inline is not inlined
/builddir/build/BUILD/bgrabitmap-10.8.1/bgrabitmap/blendpixelsover.inc(353,11) Note: (6058) Call to subroutine "procedure DifferencePixelInline(dest:PBGRAPixel;c:TBGRAPixel);" marked as inline is not inlined
/builddir/build/BUILD/bgrabitmap-10.8.1/bgrabitmap/blendpixelsover.inc(354,11) Note: (6058) Call to subroutine "procedure DrawPixelInlineNoAlphaCheck(dest:PBGRAPixel;const c:TBGRAPixel);" marked as inline is not inlined
/builddir/build/BUILD/bgrabitmap-10.8.1/bgrabitmap/blendpixelsover.inc(367,11) Note: (6058) Call to subroutine "procedure LinearDifferencePixelInline(dest:PBGRAPixel;c:TBGRAPixel);" marked as inline is not inlined
/builddir/build/BUILD/bgrabitmap-10.8.1/bgrabitmap/blendpixelsover.inc(368,11) Note: (6058) Call to subroutine "procedure FastBlendPixelInline(dest:PBGRAPixel;const c:TBGRAPixel);" marked as inline is not inlined
/builddir/build/BUILD/bgrabitmap-10.8.1/bgrabitmap/blendpixelsover.inc(381,11) Note: (6058) Call to subroutine "procedure LinearDifferencePixelInline(dest:PBGRAPixel;c:TBGRAPixel);" marked as inline is not inlined
/builddir/build/BUILD/bgrabitmap-10.8.1/bgrabitmap/blendpixelsover.inc(382,11) Note: (6058) Call to subroutine "procedure DrawPixelInlineNoAlphaCheck(dest:PBGRAPixel;const c:TBGRAPixel);" marked as inline is not inlined
/builddir/build/BUILD/bgrabitmap-10.8.1/bgrabitmap/blendpixelsover.inc(395,11) Note: (6058) Call to subroutine "procedure ExclusionPixelInline(dest:PBGRAPixel;c:TBGRAPixel);" marked as inline is not inlined
/builddir/build/BUILD/bgrabitmap-10.8.1/bgrabitmap/blendpixelsover.inc(396,11) Note: (6058) Call to subroutine "procedure FastBlendPixelInline(dest:PBGRAPixel;const c:TBGRAPixel);" marked as inline is not inlined
/builddir/build/BUILD/bgrabitmap-10.8.1/bgrabitmap/blendpixelsover.inc(409,11) Note: (6058) Call to subroutine "procedure ExclusionPixelInline(dest:PBGRAPixel;c:TBGRAPixel);" marked as inline is not inlined
/builddir/build/BUILD/bgrabitmap-10.8.1/bgrabitmap/blendpixelsover.inc(410,11) Note: (6058) Call to subroutine "procedure DrawPixelInlineNoAlphaCheck(dest:PBGRAPixel;const c:TBGRAPixel);" marked as inline is not inlined
/builddir/build/BUILD/bgrabitmap-10.8.1/bgrabitmap/blendpixelsover.inc(423,11) Note: (6058) Call to subroutine "procedure LinearExclusionPixelInline(dest:PBGRAPixel;c:TBGRAPixel);" marked as inline is not inlined
/builddir/build/BUILD/bgrabitmap-10.8.1/bgrabitmap/blendpixelsover.inc(424,11) Note: (6058) Call to subroutine "procedure FastBlendPixelInline(dest:PBGRAPixel;const c:TBGRAPixel);" marked as inline is not inlined
/builddir/build/BUILD/bgrabitmap-10.8.1/bgrabitmap/blendpixelsover.inc(437,11) Note: (6058) Call to subroutine "procedure LinearExclusionPixelInline(dest:PBGRAPixel;c:TBGRAPixel);" marked as inline is not inlined
/builddir/build/BUILD/bgrabitmap-10.8.1/bgrabitmap/blendpixelsover.inc(438,11) Note: (6058) Call to subroutine "procedure DrawPixelInlineNoAlphaCheck(dest:PBGRAPixel;const c:TBGRAPixel);" marked as inline is not inlined
/builddir/build/BUILD/bgrabitmap-10.8.1/bgrabitmap/blendpixelsover.inc(451,11) Note: (6058) Call to subroutine "procedure LinearSubtractPixelInline(dest:PBGRAPixel;c:TBGRAPixel);" marked as inline is not inlined
/builddir/build/BUILD/bgrabitmap-10.8.1/bgrabitmap/blendpixelsover.inc(452,11) Note: (6058) Call to subroutine "procedure FastBlendPixelInline(dest:PBGRAPixel;const c:TBGRAPixel);" marked as inline is not inlined
/builddir/build/BUILD/bgrabitmap-10.8.1/bgrabitmap/blendpixelsover.inc(465,11) Note: (6058) Call to subroutine "procedure LinearSubtractPixelInline(dest:PBGRAPixel;c:TBGRAPixel);" marked as inline is not inlined
/builddir/build/BUILD/bgrabitmap-10.8.1/bgrabitmap/blendpixelsover.inc(466,11) Note: (6058) Call to subroutine "procedure DrawPixelInlineNoAlphaCheck(dest:PBGRAPixel;const c:TBGRAPixel);" marked as inline is not inlined
/builddir/build/BUILD/bgrabitmap-10.8.1/bgrabitmap/blendpixelsover.inc(479,11) Note: (6058) Call to subroutine "procedure LinearSubtractInversePixelInline(dest:PBGRAPixel;c:TBGRAPixel);" marked as inline is not inlined
/builddir/build/BUILD/bgrabitmap-10.8.1/bgrabitmap/blendpixelsover.inc(480,11) Note: (6058) Call to subroutine "procedure FastBlendPixelInline(dest:PBGRAPixel;const c:TBGRAPixel);" marked as inline is not inlined
/builddir/build/BUILD/bgrabitmap-10.8.1/bgrabitmap/blendpixelsover.inc(493,11) Note: (6058) Call to subroutine "procedure LinearSubtractInversePixelInline(dest:PBGRAPixel;c:TBGRAPixel);" marked as inline is not inlined
/builddir/build/BUILD/bgrabitmap-10.8.1/bgrabitmap/blendpixelsover.inc(494,11) Note: (6058) Call to subroutine "procedure DrawPixelInlineNoAlphaCheck(dest:PBGRAPixel;const c:TBGRAPixel);" marked as inline is not inlined
/builddir/build/BUILD/bgrabitmap-10.8.1/bgrabitmap/blendpixelsover.inc(507,11) Note: (6058) Call to subroutine "procedure SubtractPixelInline(dest:PBGRAPixel;c:TBGRAPixel);" marked as inline is not inlined
/builddir/build/BUILD/bgrabitmap-10.8.1/bgrabitmap/blendpixelsover.inc(508,11) Note: (6058) Call to subroutine "procedure FastBlendPixelInline(dest:PBGRAPixel;const c:TBGRAPixel);" marked as inline is not inlined
/builddir/build/BUILD/bgrabitmap-10.8.1/bgrabitmap/blendpixelsover.inc(521,11) Note: (6058) Call to subroutine "procedure SubtractPixelInline(dest:PBGRAPixel;c:TBGRAPixel);" marked as inline is not inlined
/builddir/build/BUILD/bgrabitmap-10.8.1/bgrabitmap/blendpixelsover.inc(522,11) Note: (6058) Call to subroutine "procedure DrawPixelInlineNoAlphaCheck(dest:PBGRAPixel;const c:TBGRAPixel);" marked as inline is not inlined
/builddir/build/BUILD/bgrabitmap-10.8.1/bgrabitmap/blendpixelsover.inc(535,11) Note: (6058) Call to subroutine "procedure SubtractInversePixelInline(dest:PBGRAPixel;c:TBGRAPixel);" marked as inline is not inlined
/builddir/build/BUILD/bgrabitmap-10.8.1/bgrabitmap/blendpixelsover.inc(536,11) Note: (6058) Call to subroutine "procedure FastBlendPixelInline(dest:PBGRAPixel;const c:TBGRAPixel);" marked as inline is not inlined
/builddir/build/BUILD/bgrabitmap-10.8.1/bgrabitmap/blendpixelsover.inc(549,11) Note: (6058) Call to subroutine "procedure SubtractInversePixelInline(dest:PBGRAPixel;c:TBGRAPixel);" marked as inline is not inlined
/builddir/build/BUILD/bgrabitmap-10.8.1/bgrabitmap/blendpixelsover.inc(550,11) Note: (6058) Call to subroutine "procedure DrawPixelInlineNoAlphaCheck(dest:PBGRAPixel;const c:TBGRAPixel);" marked as inline is not inlined
/builddir/build/BUILD/bgrabitmap-10.8.1/bgrabitmap/blendpixelsover.inc(563,11) Note: (6058) Call to subroutine "procedure NegationPixelInline(dest:PBGRAPixel;c:TBGRAPixel);" marked as inline is not inlined
/builddir/build/BUILD/bgrabitmap-10.8.1/bgrabitmap/blendpixelsover.inc(564,11) Note: (6058) Call to subroutine "procedure FastBlendPixelInline(dest:PBGRAPixel;const c:TBGRAPixel);" marked as inline is not inlined
/builddir/build/BUILD/bgrabitmap-10.8.1/bgrabitmap/blendpixelsover.inc(577,11) Note: (6058) Call to subroutine "procedure NegationPixelInline(dest:PBGRAPixel;c:TBGRAPixel);" marked as inline is not inlined
/builddir/build/BUILD/bgrabitmap-10.8.1/bgrabitmap/blendpixelsover.inc(578,11) Note: (6058) Call to subroutine "procedure DrawPixelInlineNoAlphaCheck(dest:PBGRAPixel;const c:TBGRAPixel);" marked as inline is not inlined
/builddir/build/BUILD/bgrabitmap-10.8.1/bgrabitmap/blendpixelsover.inc(591,11) Note: (6058) Call to subroutine "procedure LinearNegationPixelInline(dest:PBGRAPixel;c:TBGRAPixel);" marked as inline is not inlined
/builddir/build/BUILD/bgrabitmap-10.8.1/bgrabitmap/blendpixelsover.inc(592,11) Note: (6058) Call to subroutine "procedure FastBlendPixelInline(dest:PBGRAPixel;const c:TBGRAPixel);" marked as inline is not inlined
/builddir/build/BUILD/bgrabitmap-10.8.1/bgrabitmap/blendpixelsover.inc(605,11) Note: (6058) Call to subroutine "procedure LinearNegationPixelInline(dest:PBGRAPixel;c:TBGRAPixel);" marked as inline is not inlined
/builddir/build/BUILD/bgrabitmap-10.8.1/bgrabitmap/blendpixelsover.inc(606,11) Note: (6058) Call to subroutine "procedure DrawPixelInlineNoAlphaCheck(dest:PBGRAPixel;const c:TBGRAPixel);" marked as inline is not inlined
/builddir/build/BUILD/bgrabitmap-10.8.1/bgrabitmap/blendpixelsover.inc(619,11) Note: (6058) Call to subroutine "procedure LightenPixelInline(dest:PBGRAPixel;c:TBGRAPixel);" marked as inline is not inlined
/builddir/build/BUILD/bgrabitmap-10.8.1/bgrabitmap/blendpixelsover.inc(620,11) Note: (6058) Call to subroutine "procedure FastBlendPixelInline(dest:PBGRAPixel;const c:TBGRAPixel);" marked as inline is not inlined
/builddir/build/BUILD/bgrabitmap-10.8.1/bgrabitmap/blendpixelsover.inc(633,11) Note: (6058) Call to subroutine "procedure LightenPixelInline(dest:PBGRAPixel;c:TBGRAPixel);" marked as inline is not inlined
/builddir/build/BUILD/bgrabitmap-10.8.1/bgrabitmap/blendpixelsover.inc(634,11) Note: (6058) Call to subroutine "procedure DrawPixelInlineNoAlphaCheck(dest:PBGRAPixel;const c:TBGRAPixel);" marked as inline is not inlined
/builddir/build/BUILD/bgrabitmap-10.8.1/bgrabitmap/blendpixelsover.inc(647,11) Note: (6058) Call to subroutine "procedure DarkenPixelInline(dest:PBGRAPixel;c:TBGRAPixel);" marked as inline is not inlined
/builddir/build/BUILD/bgrabitmap-10.8.1/bgrabitmap/blendpixelsover.inc(648,11) Note: (6058) Call to subroutine "procedure FastBlendPixelInline(dest:PBGRAPixel;const c:TBGRAPixel);" marked as inline is not inlined
/builddir/build/BUILD/bgrabitmap-10.8.1/bgrabitmap/blendpixelsover.inc(661,11) Note: (6058) Call to subroutine "procedure DarkenPixelInline(dest:PBGRAPixel;c:TBGRAPixel);" marked as inline is not inlined
/builddir/build/BUILD/bgrabitmap-10.8.1/bgrabitmap/blendpixelsover.inc(662,11) Note: (6058) Call to subroutine "procedure DrawPixelInlineNoAlphaCheck(dest:PBGRAPixel;const c:TBGRAPixel);" marked as inline is not inlined
/builddir/build/BUILD/bgrabitmap-10.8.1/bgrabitmap/blendpixelsover.inc(675,11) Note: (6058) Call to subroutine "procedure ScreenPixelInline(dest:PBGRAPixel;c:TBGRAPixel);" marked as inline is not inlined
/builddir/build/BUILD/bgrabitmap-10.8.1/bgrabitmap/blendpixelsover.inc(676,11) Note: (6058) Call to subroutine "procedure FastBlendPixelInline(dest:PBGRAPixel;const c:TBGRAPixel);" marked as inline is not inlined
/builddir/build/BUILD/bgrabitmap-10.8.1/bgrabitmap/blendpixelsover.inc(689,11) Note: (6058) Call to subroutine "procedure ScreenPixelInline(dest:PBGRAPixel;c:TBGRAPixel);" marked as inline is not inlined
/builddir/build/BUILD/bgrabitmap-10.8.1/bgrabitmap/blendpixelsover.inc(690,11) Note: (6058) Call to subroutine "procedure DrawPixelInlineNoAlphaCheck(dest:PBGRAPixel;const c:TBGRAPixel);" marked as inline is not inlined
/builddir/build/BUILD/bgrabitmap-10.8.1/bgrabitmap/blendpixelsover.inc(703,11) Note: (6058) Call to subroutine "procedure SoftLightPixelInline(dest:PBGRAPixel;c:TBGRAPixel);" marked as inline is not inlined
/builddir/build/BUILD/bgrabitmap-10.8.1/bgrabitmap/blendpixelsover.inc(704,11) Note: (6058) Call to subroutine "procedure FastBlendPixelInline(dest:PBGRAPixel;const c:TBGRAPixel);" marked as inline is not inlined
/builddir/build/BUILD/bgrabitmap-10.8.1/bgrabitmap/blendpixelsover.inc(717,11) Note: (6058) Call to subroutine "procedure SvgSoftLightPixelInline(dest:PBGRAPixel;c:TBGRAPixel);" marked as inline is not inlined
/builddir/build/BUILD/bgrabitmap-10.8.1/bgrabitmap/blendpixelsover.inc(718,11) Note: (6058) Call to subroutine "procedure FastBlendPixelInline(dest:PBGRAPixel;const c:TBGRAPixel);" marked as inline is not inlined
/builddir/build/BUILD/bgrabitmap-10.8.1/bgrabitmap/blendpixelsover.inc(731,11) Note: (6058) Call to subroutine "procedure SoftLightPixelInline(dest:PBGRAPixel;c:TBGRAPixel);" marked as inline is not inlined
/builddir/build/BUILD/bgrabitmap-10.8.1/bgrabitmap/blendpixelsover.inc(732,11) Note: (6058) Call to subroutine "procedure DrawPixelInlineNoAlphaCheck(dest:PBGRAPixel;const c:TBGRAPixel);" marked as inline is not inlined
/builddir/build/BUILD/bgrabitmap-10.8.1/bgrabitmap/blendpixelsover.inc(745,11) Note: (6058) Call to subroutine "procedure SvgSoftLightPixelInline(dest:PBGRAPixel;c:TBGRAPixel);" marked as inline is not inlined
/builddir/build/BUILD/bgrabitmap-10.8.1/bgrabitmap/blendpixelsover.inc(746,11) Note: (6058) Call to subroutine "procedure DrawPixelInlineNoAlphaCheck(dest:PBGRAPixel;const c:TBGRAPixel);" marked as inline is not inlined
/builddir/build/BUILD/bgrabitmap-10.8.1/bgrabitmap/blendpixelsover.inc(759,11) Note: (6058) Call to subroutine "procedure HardLightPixelInline(dest:PBGRAPixel;c:TBGRAPixel);" marked as inline is not inlined
/builddir/build/BUILD/bgrabitmap-10.8.1/bgrabitmap/blendpixelsover.inc(760,11) Note: (6058) Call to subroutine "procedure FastBlendPixelInline(dest:PBGRAPixel;const c:TBGRAPixel);" marked as inline is not inlined
/builddir/build/BUILD/bgrabitmap-10.8.1/bgrabitmap/blendpixelsover.inc(773,11) Note: (6058) Call to subroutine "procedure HardLightPixelInline(dest:PBGRAPixel;c:TBGRAPixel);" marked as inline is not inlined
/builddir/build/BUILD/bgrabitmap-10.8.1/bgrabitmap/blendpixelsover.inc(774,11) Note: (6058) Call to subroutine "procedure DrawPixelInlineNoAlphaCheck(dest:PBGRAPixel;const c:TBGRAPixel);" marked as inline is not inlined
/builddir/build/BUILD/bgrabitmap-10.8.1/bgrabitmap/blendpixelsover.inc(787,11) Note: (6058) Call to subroutine "procedure BlendXorPixelInline(dest:PBGRAPixel;c:TBGRAPixel);" marked as inline is not inlined
/builddir/build/BUILD/bgrabitmap-10.8.1/bgrabitmap/blendpixelsover.inc(788,11) Note: (6058) Call to subroutine "procedure FastBlendPixelInline(dest:PBGRAPixel;const c:TBGRAPixel);" marked as inline is not inlined
/builddir/build/BUILD/bgrabitmap-10.8.1/bgrabitmap/blendpixelsover.inc(801,11) Note: (6058) Call to subroutine "procedure BlendXorPixelInline(dest:PBGRAPixel;c:TBGRAPixel);" marked as inline is not inlined
/builddir/build/BUILD/bgrabitmap-10.8.1/bgrabitmap/blendpixelsover.inc(802,11) Note: (6058) Call to subroutine "procedure DrawPixelInlineNoAlphaCheck(dest:PBGRAPixel;const c:TBGRAPixel);" marked as inline is not inlined
/builddir/build/BUILD/bgrabitmap-10.8.1/bgrabitmap/blendpixelsover.inc(838,11) Note: (6058) Call to subroutine "procedure LinearMultiplySaturationInline(dest:PBGRAPixel;c:TBGRAPixel);" marked as inline is not inlined
/builddir/build/BUILD/bgrabitmap-10.8.1/bgrabitmap/blendpixelsover.inc(839,11) Note: (6058) Call to subroutine "procedure FastBlendPixelInline(dest:PBGRAPixel;const c:TBGRAPixel);" marked as inline is not inlined
/builddir/build/BUILD/bgrabitmap-10.8.1/bgrabitmap/blendpixelsover.inc(852,11) Note: (6058) Call to subroutine "procedure LinearMultiplySaturationInline(dest:PBGRAPixel;c:TBGRAPixel);" marked as inline is not inlined
/builddir/build/BUILD/bgrabitmap-10.8.1/bgrabitmap/blendpixelsover.inc(853,11) Note: (6058) Call to subroutine "procedure DrawPixelInlineNoAlphaCheck(dest:PBGRAPixel;const c:TBGRAPixel);" marked as inline is not inlined
/builddir/build/BUILD/bgrabitmap-10.8.1/bgrabitmap/blendpixelinline.inc(955,43) Note: (6058) Call to subroutine "function ByteSqrt(value:Byte):Byte;" marked as inline is not inlined
/builddir/build/BUILD/bgrabitmap-10.8.1/bgrabitmap/blendpixelinline.inc(970,18) Note: (6058) Call to subroutine "function ByteSqrt(value:Byte):Byte;" marked as inline is not inlined
/builddir/build/BUILD/bgrabitmap-10.8.1/bgrabitmap/blendpixelinline.inc(971,20) Note: (6058) Call to subroutine "function ByteSqrt(value:Byte):Byte;" marked as inline is not inlined
/builddir/build/BUILD/bgrabitmap-10.8.1/bgrabitmap/blendpixelinline.inc(972,20) Note: (6058) Call to subroutine "function ByteSqrt(value:Byte):Byte;" marked as inline is not inlined
/builddir/build/BUILD/bgrabitmap-10.8.1/bgrabitmap/blendpixelinline.inc(976,21) Note: (6058) Call to subroutine "function ByteSqrt(value:Byte):Byte;" marked as inline is not inlined
/builddir/build/BUILD/bgrabitmap-10.8.1/bgrabitmap/blendpixelinline.inc(978,21) Note: (6058) Call to subroutine "function ByteSqrt(value:Byte):Byte;" marked as inline is not inlined
/builddir/build/BUILD/bgrabitmap-10.8.1/bgrabitmap/blendpixelinline.inc(980,21) Note: (6058) Call to subroutine "function ByteSqrt(value:Byte):Byte;" marked as inline is not inlined
(9009) Assembling bgrablend
/builddir/build/BUILD/bgrabitmap-10.8.1/bgrabitmap/bgratransform.pas(934,3) Note: (6058) Call to subroutine "procedure TBGRAAffineScannerTransform.ScanMoveToF(X:Single;Y:Single);" marked as inline is not inlined
/builddir/build/BUILD/bgrabitmap-10.8.1/bgrabitmap/bgratransform.pas(990,3) Note: (6058) Call to subroutine "procedure TBGRAQuadLinearScanner.GetTexColorAt(u:Single;v:Single;out AColor:TBGRAPixel;out AIsPadding:Boolean);" marked as inline is not inlined
/builddir/build/BUILD/bgrabitmap-10.8.1/bgrabitmap/bgratransform.pas(1074,3) Warning: (5059) Function result variable does not seem to be initialized
/builddir/build/BUILD/bgrabitmap-10.8.1/bgrabitmap/bgratransform.pas(1141,15) Note: (6058) Call to subroutine "procedure TBGRAQuadLinearScanner.GetTexColorAt(u:Single;v:Single;out AColor:TBGRAPixel;out AIsPadding:Boolean);" marked as inline is not inlined
/builddir/build/BUILD/bgrabitmap-10.8.1/bgrabitmap/bgratransform.pas(1152,15) Note: (6058) Call to subroutine "procedure TBGRAQuadLinearScanner.GetTexColorAt(u:Single;v:Single;out AColor:TBGRAPixel;out AIsPadding:Boolean);" marked as inline is not inlined
/builddir/build/BUILD/bgrabitmap-10.8.1/bgrabitmap/bgratransform.pas(1162,15) Note: (6058) Call to subroutine "procedure TBGRAQuadLinearScanner.GetTexColorAt(u:Single;v:Single;out AColor:TBGRAPixel;out AIsPadding:Boolean);" marked as inline is not inlined
/builddir/build/BUILD/bgrabitmap-10.8.1/bgrabitmap/bgratransform.pas(1172,15) Note: (6058) Call to subroutine "procedure TBGRAQuadLinearScanner.GetTexColorAt(u:Single;v:Single;out AColor:TBGRAPixel;out AIsPadding:Boolean);" marked as inline is not inlined
/builddir/build/BUILD/bgrabitmap-10.8.1/bgrabitmap/bgratransform.pas(1189,15) Note: (6058) Call to subroutine "procedure TBGRAQuadLinearScanner.GetTexColorAt(u:Single;v:Single;out AColor:TBGRAPixel;out AIsPadding:Boolean);" marked as inline is not inlined
/builddir/build/BUILD/bgrabitmap-10.8.1/bgrabitmap/bgratransform.pas(1259,9) Note: (6058) Call to subroutine "procedure TBGRAQuadLinearScanner.GetTexColorAt(u:Single;v:Single;out AColor:TBGRAPixel;out AIsPadding:Boolean);" marked as inline is not inlined
/builddir/build/BUILD/bgrabitmap-10.8.1/bgrabitmap/bgratransform.pas(1260,9) Note: (6058) Call to subroutine "procedure TBGRAQuadLinearScanner.GetTexColorAt(u:Single;v:Single;out AColor:TBGRAPixel;out AIsPadding:Boolean);" marked as inline is not inlined
/builddir/build/BUILD/bgrabitmap-10.8.1/bgrabitmap/bgratransform.pas(1271,12) Note: (6058) Call to subroutine "procedure TBGRAQuadLinearScanner.GetTexColorAt(u:Single;v:Single;out AColor:TBGRAPixel;out AIsPadding:Boolean);" marked as inline is not inlined
/builddir/build/BUILD/bgrabitmap-10.8.1/bgrabitmap/bgratransform.pas(1275,7) Note: (6058) Call to subroutine "procedure TBGRAQuadLinearScanner.GetTexColorAt(u:Single;v:Single;out AColor:TBGRAPixel;out AIsPadding:Boolean);" marked as inline is not inlined
/builddir/build/BUILD/bgrabitmap-10.8.1/bgrabitmap/bgratransform.pas(1326,5) Note: (6058) Call to subroutine "procedure TBGRAQuadLinearScanner.GetTexColorAt(u:Single;v:Single;out AColor:TBGRAPixel;out AIsPadding:Boolean);" marked as inline is not inlined
/builddir/build/BUILD/bgrabitmap-10.8.1/bgrabitmap/bgratransform.pas(1360,7) Note: (6058) Call to subroutine "procedure TBGRAQuadLinearScanner.GetTexColorAt(u:Single;v:Single;out AColor:TBGRAPixel;out AIsPadding:Boolean);" marked as inline is not inlined
/builddir/build/BUILD/bgrabitmap-10.8.1/bgrabitmap/bgratransform.pas(2039,15) Note: (6058) Call to subroutine "function Sin65536(value:Word):Int64;" marked as inline is not inlined
/builddir/build/BUILD/bgrabitmap-10.8.1/bgrabitmap/bgratransform.pas(2040,15) Note: (6058) Call to subroutine "function Sin65536(value:Word):Int64;" marked as inline is not inlined
(9009) Assembling bgratransform
(3104) Compiling bgrapath.pas
(3104) Compiling bgraresample.pas
/builddir/build/BUILD/bgrabitmap-10.8.1/bgrabitmap/bgraresample.pas(380,30) Warning: (5036) Local variable "vertTransition" does not seem to be initialized
/builddir/build/BUILD/bgrabitmap-10.8.1/bgrabitmap/bgraresample.pas(470,15) Note: (6058) Call to subroutine "procedure DrawPixelInlineNoAlphaCheck(dest:PBGRAPixel;const c:TBGRAPixel);" marked as inline is not inlined
/builddir/build/BUILD/bgrabitmap-10.8.1/bgrabitmap/bgraresample.pas(562,15) Note: (6058) Call to subroutine "procedure DrawPixelInlineNoAlphaCheck(dest:PBGRAPixel;const c:TBGRAPixel);" marked as inline is not inlined
/builddir/build/BUILD/bgrabitmap-10.8.1/bgrabitmap/bgraresample.pas(680,15) Note: (6058) Call to subroutine "procedure DrawPixelInlineNoAlphaCheck(dest:PBGRAPixel;const c:TBGRAPixel);" marked as inline is not inlined
/builddir/build/BUILD/bgrabitmap-10.8.1/bgrabitmap/bgraresample.pas(1499,19) Hint: (5057) Local variable "sum" does not seem to be initialized
(9009) Assembling bgraresample
/builddir/build/BUILD/bgrabitmap-10.8.1/bgrabitmap/bgrapath.pas(408,5) Warning: (5036) Local variable "nb" does not seem to be initialized
/builddir/build/BUILD/bgrabitmap-10.8.1/bgrabitmap/bgrapath.pas(458,5) Warning: (5036) Local variable "nb" does not seem to be initialized
/builddir/build/BUILD/bgrabitmap-10.8.1/bgrabitmap/bgrapath.pas(760,31) Note: (6058) Call to subroutine "function Sin65536(value:Word):Int64;" marked as inline is not inlined
/builddir/build/BUILD/bgrabitmap-10.8.1/bgrabitmap/bgrapath.pas(761,31) Note: (6058) Call to subroutine "function Sin65536(value:Word):Int64;" marked as inline is not inlined
/builddir/build/BUILD/bgrabitmap-10.8.1/bgrabitmap/bgrapath.pas(2039,1) Warning: (5093) function result variable of a managed type does not seem to be initialized
/builddir/build/BUILD/bgrabitmap-10.8.1/bgrabitmap/bgrapath.pas(3092,26) Hint: (5091) Local variable "pts" of a managed type does not seem to be initialized
(9009) Assembling bgrapath
/builddir/build/BUILD/bgrabitmap-10.8.1/bgrabitmap/bgrapen.pas(983,65) Warning: (5036) Local variable "littleBorder" does not seem to be initialized
/builddir/build/BUILD/bgrabitmap-10.8.1/bgrabitmap/bgrapen.pas(1057,27) Warning: (5036) Local variable "leftInter" does not seem to be initialized
/builddir/build/BUILD/bgrabitmap-10.8.1/bgrabitmap/bgrapen.pas(1059,60) Warning: (5036) Local variable "rightInter" does not seem to be initialized
/builddir/build/BUILD/bgrabitmap-10.8.1/bgrabitmap/bgrapen.pas(1133,24) Warning: (5089) Local variable "results" of a managed type does not seem to be initialized
(9009) Assembling bgrapen
(3104) Compiling bgrapolygon.pas
(3104) Compiling bgrafillinfo.pas
/builddir/build/BUILD/bgrabitmap-10.8.1/bgrabitmap/bgrafillinfo.pas(190,37) Hint: (5024) Parameter "numPt" not used
/builddir/build/BUILD/bgrabitmap-10.8.1/bgrabitmap/bgrafillinfo.pas(190,49) Hint: (5024) Parameter "nextPt" not used
/builddir/build/BUILD/bgrabitmap-10.8.1/bgrabitmap/bgrafillinfo.pas(190,71) Hint: (5024) Parameter "ASeg" not used
/builddir/build/BUILD/bgrabitmap-10.8.1/bgrabitmap/bgrafillinfo.pas(183,118) Hint: (5024) Parameter "dy" not used
/builddir/build/BUILD/bgrabitmap-10.8.1/bgrabitmap/bgrafillinfo.pas(183,135) Hint: (5024) Parameter "AData" not used
(9009) Assembling bgrafillinfo
(3104) Compiling bgragradientscanner.pas
/builddir/build/BUILD/bgrabitmap-10.8.1/bgrabitmap/bgragradientscanner.pas(462,9) Warning: (5059) Function result variable does not seem to be initialized
/builddir/build/BUILD/bgrabitmap-10.8.1/bgrabitmap/bgragradientscanner.pas(476,9) Warning: (5059) Function result variable does not seem to be initialized
/builddir/build/BUILD/bgrabitmap-10.8.1/bgrabitmap/bgragradientscanner.pas(493,25) Note: (6058) Call to subroutine "function Sin65536(value:Word):Int64;" marked as inline is not inlined
/builddir/build/BUILD/bgrabitmap-10.8.1/bgrabitmap/bgragradientscanner.pas(543,25) Note: (6058) Call to subroutine "function Sin65536(value:Word):Int64;" marked as inline is not inlined
/builddir/build/BUILD/bgrabitmap-10.8.1/bgrabitmap/bgragradientscanner.pas(261,33) Hint: (5024) Parameter "X" not used
/builddir/build/BUILD/bgrabitmap-10.8.1/bgrabitmap/bgragradientscanner.pas(261,41) Hint: (5024) Parameter "Y" not used
/builddir/build/BUILD/bgrabitmap-10.8.1/bgrabitmap/bgragradientscanner.pas(263,26) Hint: (5024) Parameter "X" not used
/builddir/build/BUILD/bgrabitmap-10.8.1/bgrabitmap/bgragradientscanner.pas(263,34) Hint: (5024) Parameter "Y" not used
/builddir/build/BUILD/bgrabitmap-10.8.1/bgrabitmap/bgragradientscanner.pas(1084,23) Note: (6058) Call to subroutine "operator *(const c1:TColorF;factor:Single):Array[1..4] Of Single;" marked as inline is not inlined
/builddir/build/BUILD/bgrabitmap-10.8.1/bgrabitmap/bgragradientscanner.pas(1215,68) Note: (6058) Call to subroutine "function Sin65536(value:Word):Int64;" marked as inline is not inlined
/builddir/build/BUILD/bgrabitmap-10.8.1/bgrabitmap/bgragradientscanner.pas(1234,76) Note: (6058) Call to subroutine "function Sin65536(value:Word):Int64;" marked as inline is not inlined
/builddir/build/BUILD/bgrabitmap-10.8.1/bgrabitmap/bgragradientscanner.pas(1256,69) Note: (6058) Call to subroutine "function Sin65536(value:Word):Int64;" marked as inline is not inlined
/builddir/build/BUILD/bgrabitmap-10.8.1/bgrabitmap/bgragradientscanner.pas(1265,77) Note: (6058) Call to subroutine "function Sin65536(value:Word):Int64;" marked as inline is not inlined
/builddir/build/BUILD/bgrabitmap-10.8.1/bgrabitmap/bgragradientscanner.pas(1727,31) Note: (6058) Call to subroutine "procedure DrawExpandedPixelInlineNoAlphaCheck(dest:PBGRAPixel;const ec:TExpandedPixel;calpha:Byte);" marked as inline is not inlined
/builddir/build/BUILD/bgrabitmap-10.8.1/bgrabitmap/bgragradientscanner.pas(1728,22) Note: (6058) Call to subroutine "procedure FastBlendPixelInline(dest:PBGRAPixel;const c:TBGRAPixel);" marked as inline is not inlined
/builddir/build/BUILD/bgrabitmap-10.8.1/bgrabitmap/bgragradientscanner.pas(1740,9) Note: (6058) Call to subroutine "procedure DrawPixelInlineNoAlphaCheck(dest:PBGRAPixel;const c:TBGRAPixel);" marked as inline is not inlined
/builddir/build/BUILD/bgrabitmap-10.8.1/bgrabitmap/bgragradientscanner.pas(1850,66) Note: (6058) Call to subroutine "function ApplyOpacity(opacity1:Byte;opacity2:Byte):Byte;" marked as inline is not inlined
/builddir/build/BUILD/bgrabitmap-10.8.1/bgrabitmap/bgragradientscanner.pas(1850,13) Note: (6058) Call to subroutine "procedure DrawPixelInlineNoAlphaCheck(dest:PBGRAPixel;const c:TBGRAPixel);" marked as inline is not inlined
/builddir/build/BUILD/bgrabitmap-10.8.1/bgrabitmap/bgragradientscanner.pas(1857,57) Note: (6058) Call to subroutine "function ApplyOpacity(opacity1:Byte;opacity2:Byte):Byte;" marked as inline is not inlined
/builddir/build/BUILD/bgrabitmap-10.8.1/bgrabitmap/bgragradientscanner.pas(1890,13) Note: (6058) Call to subroutine "procedure DrawPixelInlineNoAlphaCheck(dest:PBGRAPixel;const c:TBGRAPixel);" marked as inline is not inlined
/builddir/build/BUILD/bgrabitmap-10.8.1/bgrabitmap/bgragradientscanner.pas(1850,66) Warning: (5036) Local variable "ptex" does not seem to be initialized
/builddir/build/BUILD/bgrabitmap-10.8.1/bgrabitmap/bgragradientscanner.pas(1850,66) Warning: (5036) Local variable "pmask" does not seem to be initialized
/builddir/build/BUILD/bgrabitmap-10.8.1/bgrabitmap/bgragradientscanner.pas(1850,66) Warning: (5036) Local variable "stride" does not seem to be initialized
/builddir/build/BUILD/bgrabitmap-10.8.1/bgrabitmap/bgragradientscanner.pas(2003,11) Note: (6058) Call to subroutine "procedure DrawPixelInlineNoAlphaCheck(dest:PBGRAPixel;const c:TBGRAPixel);" marked as inline is not inlined
/builddir/build/BUILD/bgrabitmap-10.8.1/bgrabitmap/bgragradientscanner.pas(2003,54) Warning: (5036) Local variable "pmask" does not seem to be initialized
/builddir/build/BUILD/bgrabitmap-10.8.1/bgrabitmap/bgragradientscanner.pas(2003,54) Warning: (5036) Local variable "stride" does not seem to be initialized
/builddir/build/BUILD/bgrabitmap-10.8.1/bgrabitmap/bgragradientscanner.pas(2128,9) Note: (6058) Call to subroutine "procedure DrawPixelInlineNoAlphaCheck(dest:PBGRAPixel;const c:TBGRAPixel);" marked as inline is not inlined
/builddir/build/BUILD/bgrabitmap-10.8.1/bgrabitmap/bgragradientscanner.pas(2128,52) Warning: (5036) Local variable "ptex" does not seem to be initialized
(9009) Assembling bgragradientscanner
/builddir/build/BUILD/bgrabitmap-10.8.1/bgrabitmap/bgrapolygon.pas(866,1) Fatal: Internal error 2002090904
Fatal: (1018) Compilation aborted
Error: /usr/bin/ppcppc64 returned an error exitcode
Error: (lazarus) Compile package BGRABitmapPack 10.8.1: stopped with exit code 1
Error: (lazbuild) BGRABitmapPack 10.8.1 compilation failed
RPM build errors:
error: Bad exit status from /var/tmp/rpm-tmp.RUUKm5 (%build)
    Bad exit status from /var/tmp/rpm-tmp.RUUKm5 (%build)
Child return code was: 1
EXCEPTION: [Error()]
Traceback (most recent call last):
  File "/usr/lib/python3.7/site-packages/mockbuild/trace_decorator.py", line 93, in trace
    result = func(*args, **kw)
  File "/usr/lib/python3.7/site-packages/mockbuild/util.py", line 755, in do_with_status
    raise exception.Error("Command failed: \n # %s\n%s" % (command, output), child.returncode)
mockbuild.exception.Error: Command failed: 
 # bash --login -c /usr/bin/rpmbuild -bb --target ppc64le --nodeps /builddir/build/SPECS/bgrabitmap.spec

bgrabitmap-build.log (108,235 bytes)   
ccdciel-build.log (95,925 bytes)   
Mock Version: 2.1
Mock Version: 2.1
Mock Version: 2.1
ENTER ['do_with_status'](['bash', '--login', '-c', '/usr/bin/rpmbuild -bs --target ppc64le --nodeps /builddir/build/SPECS/ccdciel.spec'], chrootPath='/var/lib/mock/f33-build-20336579-1451603/root'env={'TERM': 'vt100', 'SHELL': '/bin/bash', 'HOME': '/builddir', 'HOSTNAME': 'mock', 'PATH': '/usr/bin:/bin:/usr/sbin:/sbin', 'PROMPT_COMMAND': 'printf "\\033]0;<mock-chroot>\\007"', 'PS1': '<mock-chroot> \\s-\\v\\$ ', 'LANG': 'C.UTF-8'}shell=Falselogger=<mockbuild.trace_decorator.getLog object at 0x7fff8f36f910>timeout=201600uid=1000gid=425user='mockbuild'nspawn_args=[]unshare_net=TrueprintOutput=False)
Executing command: ['bash', '--login', '-c', '/usr/bin/rpmbuild -bs --target ppc64le --nodeps /builddir/build/SPECS/ccdciel.spec'] with env {'TERM': 'vt100', 'SHELL': '/bin/bash', 'HOME': '/builddir', 'HOSTNAME': 'mock', 'PATH': '/usr/bin:/bin:/usr/sbin:/sbin', 'PROMPT_COMMAND': 'printf "\\033]0;<mock-chroot>\\007"', 'PS1': '<mock-chroot> \\s-\\v\\$ ', 'LANG': 'C.UTF-8'} and shell False
Building target platforms: ppc64le
Building for target ppc64le
setting SOURCE_DATE_EPOCH=1587168000
Wrote: /builddir/build/SRPMS/ccdciel-0.9.68-4.fc33.src.rpm
Child return code was: 0
ENTER ['do_with_status'](['bash', '--login', '-c', '/usr/bin/rpmbuild -bb --target ppc64le --nodeps /builddir/build/SPECS/ccdciel.spec'], chrootPath='/var/lib/mock/f33-build-20336579-1451603/root'env={'TERM': 'vt100', 'SHELL': '/bin/bash', 'HOME': '/builddir', 'HOSTNAME': 'mock', 'PATH': '/usr/bin:/bin:/usr/sbin:/sbin', 'PROMPT_COMMAND': 'printf "\\033]0;<mock-chroot>\\007"', 'PS1': '<mock-chroot> \\s-\\v\\$ ', 'LANG': 'C.UTF-8'}shell=Falselogger=<mockbuild.trace_decorator.getLog object at 0x7fff8f36f910>timeout=201600uid=1000gid=425user='mockbuild'nspawn_args=[]unshare_net=TrueprintOutput=False)
Executing command: ['bash', '--login', '-c', '/usr/bin/rpmbuild -bb --target ppc64le --nodeps /builddir/build/SPECS/ccdciel.spec'] with env {'TERM': 'vt100', 'SHELL': '/bin/bash', 'HOME': '/builddir', 'HOSTNAME': 'mock', 'PATH': '/usr/bin:/bin:/usr/sbin:/sbin', 'PROMPT_COMMAND': 'printf "\\033]0;<mock-chroot>\\007"', 'PS1': '<mock-chroot> \\s-\\v\\$ ', 'LANG': 'C.UTF-8'} and shell False
Building target platforms: ppc64le
Building for target ppc64le
setting SOURCE_DATE_EPOCH=1587168000
Executing(%prep): /bin/sh -e /var/tmp/rpm-tmp.QToDyy
+ umask 022
+ cd /builddir/build/BUILD
+ cd /builddir/build/BUILD
+ rm -rf ccdciel-0.9.68
+ /usr/bin/gzip -dc /builddir/build/SOURCES/ccdciel-0.9.68.tar.gz
+ /usr/bin/tar -xof -
+ STATUS=0
+ '[' 0 -ne 0 ']'
+ cd ccdciel-0.9.68
+ /usr/bin/chmod -Rf a+rX,u+w,g-w,o-w .
+ /usr/bin/cat /builddir/build/SOURCES/ccdciel-0.9.55_fix_debuginfo.patch
+ /usr/bin/patch -p1 -s --fuzz=0 --no-backup-if-mismatch
+ rm -rf library/Makefile.in library/cfitsio library/raw library/wcs
+ RPM_EC=0
++ jobs -p
+ exit 0
Executing(%build): /bin/sh -e /var/tmp/rpm-tmp.mjUxkz
+ umask 022
+ cd /builddir/build/BUILD
+ cd ccdciel-0.9.68
+ ./configure lazarus=/usr/lib64/lazarus prefix=/usr
using fpcbin in /usr/bin
using fpc units in /usr/share/fpcsrc
using Lazarus in /usr/lib64/lazarus
installing in /usr
fpcmake options: -q
create component/synapse/source/lib/Makefile
create component/indiclient/Makefile
create component/bgrabitmap/Makefile
create component/enhedits/Makefile
create component/xmlparser/Makefile
create component/vosamp/Makefile
create component/Makefile
create library/Makefile
sed: can't read Makefile.in: No such file or directory
create src/Makefile
create ./Makefile
You can now build with:
make clean all
make install
To crosscompile from Linux to Windows:
make clean all OS_TARGET=win32 CPU_TARGET=i386
make install_win
+ make 'fpcopts=-O1 -gw3 -fPIC'
/bin/sh: gcc: command not found
dirname: missing operand
Try 'dirname --help' for more information.
make -C component all
make[1]: Entering directory '/builddir/build/BUILD/ccdciel-0.9.68/component'
mkdir -p lib/powerpc64-linux-gtk2
make -C synapse/source/lib all
make[2]: Entering directory '/builddir/build/BUILD/ccdciel-0.9.68/component/synapse/source/lib'
/usr/bin/rm -f lib/powerpc64-linux-gtk2/synapse.ppu
/usr/bin/mkdir -p lib/powerpc64-linux-gtk2
/usr/bin/ppcppc64 -O1 -gw3 -fPIC -MObjFPC -Sgi -Fu/usr/lib64/lazarus/packager/units/powerpc64-linux/ -Fu./ -Fi./ -FE. -FUlib/powerpc64-linux-gtk2 -dpowerpc64 synapse.pas
Free Pascal Compiler version 3.2.0-beta [2020/04/12] for powerpc64
Copyright (c) 1993-2020 by Florian Klaempfl and others
Target OS: Linux for PowerPC64
Compiling synapse.pas
Compiling blcksock.pas
Compiling synafpc.pas
Assembling synafpc
Compiling synsock.pas
ssfpc.inc(714,26) Warning: Symbol "HostToNet" is deprecated
ssfpc.inc(824,18) Warning: Symbol "HostToNet" is deprecated
ssfpc.inc(884,25) Warning: Symbol "NetToHost" is deprecated
Assembling synsock
Compiling synautil.pas
synautil.pas(637,96) Warning: Symbol "TimeSeparator" is deprecated
synautil.pas(1981,3) Note: Local variable "BackStop" is assigned but never used
synautil.pas(2121,88) Warning: Symbol "ShortMonthNames" is deprecated
synautil.pas(2122,87) Warning: Symbol "ShortMonthNames" is deprecated
Assembling synautil
Compiling synacode.pas
Assembling synacode
Compiling synaip.pas
Assembling synaip
Assembling blcksock
Compiling ftpsend.pas
Assembling ftpsend
Compiling httpsend.pas
Assembling httpsend
Compiling synaser.pas
synaser.pas(2332,39) Warning: range check error while evaluating constants (4294967295 must be between -2147483648 and 2147483647)
synaser.pas(2342,41) Warning: range check error while evaluating constants (4294967295 must be between -2147483648 and 2147483647)
synaser.pas(2351,40) Warning: range check error while evaluating constants (4294967295 must be between -2147483648 and 2147483647)
Assembling synaser
Compiling ssl_openssl.pas
Compiling ssl_openssl_lib.pas
Assembling ssl_openssl_lib
Assembling ssl_openssl
Compiling dnssend.pas
Assembling dnssend
Compiling smtpsend.pas
Assembling smtpsend
Assembling synapse
20686 lines compiled, 2.1 sec
9 warning(s) issued
1 note(s) issued
make[2]: Leaving directory '/builddir/build/BUILD/ccdciel-0.9.68/component/synapse/source/lib'
make -C bgrabitmap all
make[2]: Entering directory '/builddir/build/BUILD/ccdciel-0.9.68/component/bgrabitmap'
/usr/bin/rm -f lib/powerpc64-linux/bgrabitmappack_nogl.ppu
/usr/bin/mkdir -p lib/powerpc64-linux
/usr/bin/ppcppc64 -O1 -gw3 -fPIC -MObjFPC -Scghi -vewnhi -l -dLCL -dLCLgtk2 -Fu/usr/lib64/lazarus/lcl/units/powerpc64-linux -Fu/usr/lib64/lazarus/lcl/units/powerpc64-linux/gtk2 -Fu/usr/lib64/lazarus/packager/units/powerpc64-linux -Fu/usr/lib64/lazarus/components/lazutils/lib/powerpc64-linux -Fu/usr/lib64/lazarus/ideintf/units/powerpc64-linux/gtk2 -Fu./ -Fi./ -FE. -FUlib/powerpc64-linux -dpowerpc64 bgrabitmappack_nogl.pas
Hint: Start of reading config file /etc/fpc.cfg
Hint: End of reading config file /etc/fpc.cfg
Free Pascal Compiler version 3.2.0-beta [2020/04/12] for powerpc64
Copyright (c) 1993-2020 by Florian Klaempfl and others
Target OS: Linux for PowerPC64
Compiling bgrabitmappack_nogl.pas
Compiling bgraanimatedgif.pas
Compiling bgragraphics.pas
Assembling bgragraphics
Compiling bgrabitmap.pas
Compiling bgragtkbitmap.pas
Compiling bgralclbitmap.pas
Compiling bgrabitmaptypes.pas
Compiling bgramultifiletype.pas
Compiling bgrautf8.pas
Compiling bgraunicode.pas
bgraunicode.pas(739,88) Hint: Parameter "endOfSequence" not used
bgraunicode.pas(900,87) Hint: Parameter "endOfSequence" not used
bgraunicode.pas(1500,14) Hint: Local variable "a" of a managed type does not seem to be initialized
bgraunicode.pas(1501,19) Warning: function result variable of a managed type does not seem to be initialized
bgraunicode.pas(1586,19) Warning: function result variable of a managed type does not seem to be initialized
bgraunicode.pas(1608,21) Hint: Local variable "levels" of a managed type does not seem to be initialized
bgraunicode.pas(1609,30) Hint: Local variable "originalIndices" of a managed type does not seem to be initialized
Assembling bgraunicode
bgrautf8.pas(183,13) Warning: Symbol "UTF8CharacterLength" is deprecated: "Use UTF8CodepointSize instead."
Assembling bgrautf8
Compiling bgrabitmaptypes.pas
Compiling bgrawritepng.pas
bgrawritepng.pas(86,38) Hint: Parameter "Current" not used
bgrawritepng.pas(86,52) Hint: Parameter "Previous" not used
bgrawritepng.pas(86,78) Hint: Parameter "linelength" not used
bgrawritepng.pas(69,37) Hint: Parameter "Str" not used
bgrawritepng.pas(69,55) Hint: Parameter "Img" not used
Assembling bgrawritepng
geometrytypes.inc(1086,13) Note: Call to subroutine "function GammaExpansion(c:TBGRAPixel):<record type>;" marked as inline is not inlined
geometrytypes.inc(1113,13) Note: Call to subroutine "function GammaExpansion(c:TBGRAPixel):<record type>;" marked as inline is not inlined
geometrytypes.inc(1164,21) Warning: function result variable of a managed type does not seem to be initialized
geometrytypes.inc(1409,19) Warning: function result variable of a managed type does not seem to be initialized
geometrytypes.inc(1422,19) Warning: function result variable of a managed type does not seem to be initialized
bezier.inc(246,21) Warning: function result variable of a managed type does not seem to be initialized
bezier.inc(486,21) Warning: function result variable of a managed type does not seem to be initialized
bezier.inc(826,20) Hint: Local variable "parts" of a managed type does not seem to be initialized
bezier.inc(924,19) Warning: function result variable of a managed type does not seem to be initialized
bezier.inc(148,55) Hint: Parameter "AData" not used
unibitmap.inc(1083,27) Hint: Local variable "temp" does not seem to be initialized
unibitmap.inc(1105,22) Hint: Variable "ADest" does not seem to be initialized
unibitmap.inc(1156,18) Hint: Local variable "pts" of a managed type does not seem to be initialized
unibitmap.inc(1387,5) Note: Call to subroutine "procedure TBridgedConversion.Convert(ASource:Pointer;ADest:Pointer;ACount:LongInt;ASourceStride:LongInt;ADestStride:LongInt;AReferenceWhite:PXYZReferenceWhite);" marked as inline is not inlined
unibitmap.inc(1387,83) Note: Call to subroutine "function PositiveMod(value:Int64;cycle:Int64):Int64;" marked as inline is not inlined
unibitmap.inc(1388,70) Note: Call to subroutine "function PositiveMod(value:Int64;cycle:Int64):Int64;" marked as inline is not inlined
unibitmap.inc(1397,5) Note: Call to subroutine "procedure TBridgedConversion.Convert(ASource:Pointer;ADest:Pointer;ACount:LongInt;ASourceStride:LongInt;ADestStride:LongInt;AReferenceWhite:PXYZReferenceWhite);" marked as inline is not inlined
unibitmap.inc(1397,87) Note: Call to subroutine "function PositiveMod(value:Int64;cycle:Int64):Int64;" marked as inline is not inlined
unibitmap.inc(1398,74) Note: Call to subroutine "function PositiveMod(value:Int64;cycle:Int64):Int64;" marked as inline is not inlined
unibitmap.inc(1408,16) Note: Call to subroutine "function PositiveMod(value:Int64;cycle:Int64):Int64;" marked as inline is not inlined
unibitmap.inc(1409,16) Note: Call to subroutine "function PositiveMod(value:Int64;cycle:Int64):Int64;" marked as inline is not inlined
unibitmap.inc(1417,5) Note: Call to subroutine "procedure TBridgedConversion.Convert(ASource:Pointer;ADest:Pointer;ACount:LongInt;ASourceStride:LongInt;ADestStride:LongInt;AReferenceWhite:PXYZReferenceWhite);" marked as inline is not inlined
unibitmap.inc(1434,5) Note: Call to subroutine "procedure TBridgedConversion.Convert(ASource:Pointer;ADest:Pointer;ACount:LongInt;ASourceStride:LongInt;ADestStride:LongInt;AReferenceWhite:PXYZReferenceWhite);" marked as inline is not inlined
unibitmap.inc(646,34) Hint: Parameter "pdest" not used
unibitmap.inc(646,58) Hint: Parameter "count" not used
unibitmap.inc(646,79) Hint: Parameter "mode" not used
unibitmap.inc(1473,42) Note: Call to subroutine "function PositiveMod(value:Int64;cycle:Int64):Int64;" marked as inline is not inlined
unibitmap.inc(631,36) Hint: Parameter "ARect" not used
unibitmap.inc(632,33) Hint: Parameter "X" not used
unibitmap.inc(632,41) Hint: Parameter "Y" not used
unibitmap.inc(655,42) Hint: Parameter "ACount" not used
unibitmap.inc(655,68) Hint: Parameter "AMask" not used
unibitmap.inc(655,95) Hint: Parameter "AStride" not used
unibitmap.inc(657,30) Hint: Parameter "X" not used
unibitmap.inc(657,37) Hint: Parameter "Y" not used
unibitmap.inc(197,41) Hint: Parameter "ABrush" not used
unibitmap.inc(197,71) Hint: Parameter "AAlpha" not used
unibitmap.inc(198,41) Hint: Parameter "ABrush" not used
unibitmap.inc(198,71) Hint: Parameter "AAlpha" not used
unibitmap.inc(2090,3) Note: Call to subroutine "procedure TBridgedConversion.Convert(ASource:Pointer;ADest:Pointer;ACount:LongInt;ASourceStride:LongInt;ADestStride:LongInt;AReferenceWhite:PXYZReferenceWhite);" marked as inline is not inlined
unibitmap.inc(2099,3) Note: Call to subroutine "procedure TBridgedConversion.Convert(ASource:Pointer;ADest:Pointer;ACount:LongInt;ASourceStride:LongInt;ADestStride:LongInt;AReferenceWhite:PXYZReferenceWhite);" marked as inline is not inlined
unibitmap.inc(2110,3) Note: Call to subroutine "procedure TBridgedConversion.Convert(ASource:Pointer;ADest:Pointer;ACount:LongInt;ASourceStride:LongInt;ADestStride:LongInt;AReferenceWhite:PXYZReferenceWhite);" marked as inline is not inlined
unibitmap.inc(2119,3) Note: Call to subroutine "procedure TBridgedConversion.Convert(ASource:Pointer;ADest:Pointer;ACount:LongInt;ASourceStride:LongInt;ADestStride:LongInt;AReferenceWhite:PXYZReferenceWhite);" marked as inline is not inlined
unibitmap.inc(66,40) Hint: Parameter "AAlpha" not used
unibitmap.inc(204,43) Hint: Parameter "ABrush" not used
unibitmap.inc(204,73) Hint: Parameter "AScanner" not used
unibitmap.inc(204,102) Hint: Parameter "ADrawMode" not used
unibitmap.inc(205,39) Hint: Parameter "AOffsetX" not used
unibitmap.inc(205,67) Hint: Parameter "AOffsetY" not used
unibitmap.inc(206,40) Hint: Parameter "ABrush" not used
unibitmap.inc(206,70) Hint: Parameter "AScanner" not used
unibitmap.inc(207,36) Hint: Parameter "AOffsetX" not used
unibitmap.inc(207,64) Hint: Parameter "AOffsetY" not used
unibitmap.inc(2257,3) Note: Call to subroutine "procedure TBridgedConversion.Convert(ASource:Pointer;ADest:Pointer;ACount:LongInt;ASourceStride:LongInt;ADestStride:LongInt;AReferenceWhite:PXYZReferenceWhite);" marked as inline is not inlined
unibitmap.inc(2266,3) Note: Call to subroutine "procedure TBridgedConversion.Convert(ASource:Pointer;ADest:Pointer;ACount:LongInt;ASourceStride:LongInt;ADestStride:LongInt;AReferenceWhite:PXYZReferenceWhite);" marked as inline is not inlined
unibitmap.inc(2331,9) Note: Call to subroutine "procedure TBridgedConversion.Convert(ASource:Pointer;ADest:Pointer;ACount:LongInt;ASourceStride:LongInt;ADestStride:LongInt;AReferenceWhite:PXYZReferenceWhite);" marked as inline is not inlined
unibitmap.inc(2406,12) Note: Call to subroutine "function PositiveMod(value:Int64;cycle:Int64):Int64;" marked as inline is not inlined
unibitmap.inc(2407,11) Note: Call to subroutine "function PositiveMod(value:Int64;cycle:Int64):Int64;" marked as inline is not inlined
unibitmap.inc(2484,27) Hint: Local variable "lWidth" does not seem to be initialized
unibitmap.inc(2485,28) Hint: Local variable "lHeight" does not seem to be initialized
unibitmap.inc(2879,51) Note: Call to subroutine "function PositiveMod(value:Int64;cycle:Int64):Int64;" marked as inline is not inlined
unibitmap.inc(2879,75) Note: Call to subroutine "function PositiveMod(value:Int64;cycle:Int64):Int64;" marked as inline is not inlined
unibitmapgeneric.inc(261,21) Note: Call to subroutine "operator =(const c1:TBGRAPixel;const c2:TBGRAPixel):Boolean;" marked as inline is not inlined
unibitmapgeneric.inc(279,19) Note: Call to subroutine "operator =(const c1:TBGRAPixel;const c2:TBGRAPixel):Boolean;" marked as inline is not inlined
unibitmapgeneric.inc(310,13) Note: Call to subroutine "operator =(const c1:TBGRAPixel;const c2:TBGRAPixel):Boolean;" marked as inline is not inlined
unibitmapgeneric.inc(481,11) Note: Call to subroutine "operator =(const c1:TBGRAPixel;const c2:TBGRAPixel):Boolean;" marked as inline is not inlined
unibitmapgeneric.inc(501,13) Note: Call to subroutine "operator =(const c1:TBGRAPixel;const c2:TBGRAPixel):Boolean;" marked as inline is not inlined
unibitmapgeneric.inc(435,63) Note: Call to subroutine "function PositiveMod(value:Int64;cycle:Int64):Int64;" marked as inline is not inlined
unibitmapgeneric.inc(435,67) Note: Call to subroutine "function PositiveMod(value:Int64;cycle:Int64):Int64;" marked as inline is not inlined
csscolorconst.inc(188,12) Note: Call to subroutine "function BGRA(red:Byte;green:Byte;blue:Byte):<record type>;" marked as inline is not inlined
csscolorconst.inc(236,17) Note: Call to subroutine "operator =(const c1:TBGRAPixel;const c2:TBGRAPixel):Boolean;" marked as inline is not inlined
csscolorconst.inc(542,13) Note: Call to subroutine "function BGRA(red:Byte;green:Byte;blue:Byte):<record type>;" marked as inline is not inlined
bgracustombitmap.inc(747,40) Note: Call to subroutine "function BGRA(red:Byte;green:Byte;blue:Byte;alpha:Byte):<record type>;" marked as inline is not inlined
bgracustombitmap.inc(748,41) Note: Call to subroutine "function BGRA(red:Byte;green:Byte;blue:Byte;alpha:Byte):<record type>;" marked as inline is not inlined
bgracustombitmap.inc(752,40) Note: Call to subroutine "function BGRA(red:Byte;green:Byte;blue:Byte;alpha:Byte):<record type>;" marked as inline is not inlined
bgracustombitmap.inc(753,41) Note: Call to subroutine "function BGRA(red:Byte;green:Byte;blue:Byte;alpha:Byte):<record type>;" marked as inline is not inlined
bgracustombitmap.inc(757,40) Note: Call to subroutine "function BGRA(red:Byte;green:Byte;blue:Byte;alpha:Byte):<record type>;" marked as inline is not inlined
bgracustombitmap.inc(758,41) Note: Call to subroutine "function BGRA(red:Byte;green:Byte;blue:Byte;alpha:Byte):<record type>;" marked as inline is not inlined
bgracustombitmap.inc(762,40) Note: Call to subroutine "function BGRA(red:Byte;green:Byte;blue:Byte;alpha:Byte):<record type>;" marked as inline is not inlined
bgracustombitmap.inc(763,41) Note: Call to subroutine "function BGRA(red:Byte;green:Byte;blue:Byte;alpha:Byte):<record type>;" marked as inline is not inlined
bgracustombitmap.inc(834,13) Note: Call to subroutine "function GammaExpansion(c:TBGRAPixel):<record type>;" marked as inline is not inlined
bgracustombitmap.inc(853,13) Note: Call to subroutine "function GammaExpansion(c:TBGRAPixel):<record type>;" marked as inline is not inlined
bgracustombitmap.inc(858,13) Note: Call to subroutine "function GammaExpansion(c:TBGRAPixel):<record type>;" marked as inline is not inlined
bgracustombitmap.inc(79,36) Hint: Parameter "ARect" not used
bgracustombitmap.inc(80,33) Hint: Parameter "X" not used
bgracustombitmap.inc(80,40) Hint: Parameter "Y" not used
bgracustombitmap.inc(1631,14) Note: Call to subroutine "function PositiveMod(value:Int64;cycle:Int64):Int64;" marked as inline is not inlined
bgracustombitmap.inc(1632,14) Note: Call to subroutine "function PositiveMod(value:Int64;cycle:Int64):Int64;" marked as inline is not inlined
bgracustombitmap.inc(1962,13) Note: Call to subroutine "function GammaExpansion(c:TBGRAPixel):<record type>;" marked as inline is not inlined
bgracustombitmap.inc(1967,13) Note: Call to subroutine "function GammaExpansion(c:TBGRAPixel):<record type>;" marked as inline is not inlined
bgracustombitmap.inc(1972,13) Note: Call to subroutine "function GammaExpansion(c:TBGRAPixel):<record type>;" marked as inline is not inlined
basiccolorspace.inc(269,13) Note: Call to subroutine "function GetIntensity(c:TBGRAPixel):Word;" marked as inline is not inlined
basiccolorspace.inc(354,13) Note: Call to subroutine "function BGRAToFPColor(AValue:TBGRAPixel):<record type>;" marked as inline is not inlined
basiccolorspace.inc(831,19) Warning: function result variable of a managed type does not seem to be initialized
basiccolorspace.inc(1417,11) Note: Call to subroutine "function BGRAToFPColor(AValue:TBGRAPixel):<record type>;" marked as inline is not inlined
extendedcolorspace.inc(224,29) Hint: Variable "ADest" does not seem to be initialized
extendedcolorspace.inc(296,15) Hint: Parameter "ASourceStride" not used
extendedcolorspace.inc(296,64) Hint: Parameter "AReferenceWhite" not used
generatedcolorspace.inc(1423,179) Hint: Parameter "AReferenceWhite" not used
generatedcolorspace.inc(1431,17) Note: Call to subroutine "function BGRAToFPColor(AValue:TBGRAPixel):<record type>;" marked as inline is not inlined
generatedcolorspace.inc(1434,175) Hint: Parameter "AReferenceWhite" not used
generatedcolorspace.inc(1445,175) Hint: Parameter "AReferenceWhite" not used
generatedcolorspace.inc(1456,175) Hint: Parameter "AReferenceWhite" not used
generatedcolorspace.inc(1467,175) Hint: Parameter "AReferenceWhite" not used
generatedcolorspace.inc(1477,175) Hint: Parameter "AReferenceWhite" not used
generatedcolorspace.inc(1487,177) Hint: Parameter "AReferenceWhite" not used
generatedcolorspace.inc(1498,187) Hint: Parameter "AReferenceWhite" not used
generatedcolorspace.inc(1505,179) Hint: Parameter "AReferenceWhite" not used
generatedcolorspace.inc(1512,183) Hint: Parameter "AReferenceWhite" not used
generatedcolorspace.inc(1515,25) Note: Call to subroutine "function BGRAToFPColor(AValue:TBGRAPixel):<record type>;" marked as inline is not inlined
generatedcolorspace.inc(1519,183) Hint: Parameter "AReferenceWhite" not used
generatedcolorspace.inc(1529,183) Hint: Parameter "AReferenceWhite" not used
generatedcolorspace.inc(1539,183) Hint: Parameter "AReferenceWhite" not used
generatedcolorspace.inc(1549,183) Hint: Parameter "AReferenceWhite" not used
generatedcolorspace.inc(1556,185) Hint: Parameter "AReferenceWhite" not used
generatedcolorspace.inc(1563,195) Hint: Parameter "AReferenceWhite" not used
generatedcolorspace.inc(1573,175) Hint: Parameter "AReferenceWhite" not used
generatedcolorspace.inc(1580,183) Hint: Parameter "AReferenceWhite" not used
generatedcolorspace.inc(1590,181) Hint: Parameter "AReferenceWhite" not used
generatedcolorspace.inc(1597,191) Hint: Parameter "AReferenceWhite" not used
generatedcolorspace.inc(1607,175) Hint: Parameter "AReferenceWhite" not used
generatedcolorspace.inc(1614,183) Hint: Parameter "AReferenceWhite" not used
generatedcolorspace.inc(1621,179) Hint: Parameter "AReferenceWhite" not used
generatedcolorspace.inc(1628,179) Hint: Parameter "AReferenceWhite" not used
generatedcolorspace.inc(1635,179) Hint: Parameter "AReferenceWhite" not used
generatedcolorspace.inc(1645,181) Hint: Parameter "AReferenceWhite" not used
generatedcolorspace.inc(1652,191) Hint: Parameter "AReferenceWhite" not used
generatedcolorspace.inc(1662,195) Hint: Parameter "AReferenceWhite" not used
generatedcolorspace.inc(1672,189) Hint: Parameter "AReferenceWhite" not used
generatedcolorspace.inc(1704,177) Hint: Parameter "AReferenceWhite" not used
generatedcolorspace.inc(1714,177) Hint: Parameter "AReferenceWhite" not used
generatedcolorspace.inc(1724,175) Hint: Parameter "AReferenceWhite" not used
generatedcolorspace.inc(1734,183) Hint: Parameter "AReferenceWhite" not used
generatedcolorspace.inc(1741,179) Hint: Parameter "AReferenceWhite" not used
generatedcolorspace.inc(1748,179) Hint: Parameter "AReferenceWhite" not used
generatedcolorspace.inc(1758,179) Hint: Parameter "AReferenceWhite" not used
generatedcolorspace.inc(1768,181) Hint: Parameter "AReferenceWhite" not used
generatedcolorspace.inc(1778,191) Hint: Parameter "AReferenceWhite" not used
generatedcolorspace.inc(1788,175) Hint: Parameter "AReferenceWhite" not used
generatedcolorspace.inc(1798,183) Hint: Parameter "AReferenceWhite" not used
generatedcolorspace.inc(1805,179) Hint: Parameter "AReferenceWhite" not used
generatedcolorspace.inc(1812,179) Hint: Parameter "AReferenceWhite" not used
generatedcolorspace.inc(1822,179) Hint: Parameter "AReferenceWhite" not used
generatedcolorspace.inc(1832,181) Hint: Parameter "AReferenceWhite" not used
generatedcolorspace.inc(1842,191) Hint: Parameter "AReferenceWhite" not used
generatedcolorspace.inc(1852,175) Hint: Parameter "AReferenceWhite" not used
generatedcolorspace.inc(1863,183) Hint: Parameter "AReferenceWhite" not used
generatedcolorspace.inc(1870,179) Hint: Parameter "AReferenceWhite" not used
generatedcolorspace.inc(1881,179) Hint: Parameter "AReferenceWhite" not used
generatedcolorspace.inc(1892,179) Hint: Parameter "AReferenceWhite" not used
generatedcolorspace.inc(1902,181) Hint: Parameter "AReferenceWhite" not used
generatedcolorspace.inc(1913,191) Hint: Parameter "AReferenceWhite" not used
generatedcolorspace.inc(1923,177) Hint: Parameter "AReferenceWhite" not used
generatedcolorspace.inc(1930,185) Hint: Parameter "AReferenceWhite" not used
generatedcolorspace.inc(1938,17) Note: Call to subroutine "function BGRAToFPColor(AValue:TBGRAPixel):<record type>;" marked as inline is not inlined
generatedcolorspace.inc(1941,181) Hint: Parameter "AReferenceWhite" not used
generatedcolorspace.inc(1952,181) Hint: Parameter "AReferenceWhite" not used
generatedcolorspace.inc(1963,181) Hint: Parameter "AReferenceWhite" not used
generatedcolorspace.inc(1974,181) Hint: Parameter "AReferenceWhite" not used
generatedcolorspace.inc(1984,181) Hint: Parameter "AReferenceWhite" not used
generatedcolorspace.inc(1991,193) Hint: Parameter "AReferenceWhite" not used
generatedcolorspace.inc(2001,187) Hint: Parameter "AReferenceWhite" not used
generatedcolorspace.inc(2008,195) Hint: Parameter "AReferenceWhite" not used
generatedcolorspace.inc(2015,191) Hint: Parameter "AReferenceWhite" not used
generatedcolorspace.inc(2022,191) Hint: Parameter "AReferenceWhite" not used
generatedcolorspace.inc(2032,195) Hint: Parameter "AReferenceWhite" not used
generatedcolorspace.inc(2042,191) Hint: Parameter "AReferenceWhite" not used
generatedcolorspace.inc(2052,191) Hint: Parameter "AReferenceWhite" not used
generatedcolorspace.inc(2062,191) Hint: Parameter "AReferenceWhite" not used
generatedcolorspace.inc(2069,193) Hint: Parameter "AReferenceWhite" not used
generatedcolorspace.inc(2076,197) Hint: Parameter "AReferenceWhite" not used
generatedcolorspace.inc(2083,195) Hint: Parameter "AReferenceWhite" not used
generatedcolorspace.inc(2090,195) Hint: Parameter "AReferenceWhite" not used
generatedcolorspace.inc(2122,185) Hint: Parameter "AReferenceWhite" not used
generatedcolorspace.inc(2132,185) Hint: Parameter "AReferenceWhite" not used
generatedcolorspace.inc(2142,189) Hint: Parameter "AReferenceWhite" not used
generatedcolorspace.inc(2149,197) Hint: Parameter "AReferenceWhite" not used
generatedcolorspace.inc(2167,179) Hint: Parameter "AReferenceWhite" not used
generatedcolorspace.inc(2177,179) Hint: Parameter "AReferenceWhite" not used
generatedcolorspace.inc(2184,195) Hint: Parameter "AReferenceWhite" not used
generatedcolorspace.inc(2191,187) Hint: Parameter "AReferenceWhite" not used
generatedcolorspace.inc(2198,195) Hint: Parameter "AReferenceWhite" not used
generatedcolorspace.inc(2205,187) Hint: Parameter "AReferenceWhite" not used
generatedcolorspace.inc(2242,175) Hint: Parameter "AReferenceWhite" not used
generatedcolorspace.inc(2293,175) Hint: Parameter "AReferenceWhite" not used
generatedcolorspace.inc(2331,177) Hint: Parameter "AReferenceWhite" not used
generatedcolorspace.inc(2341,185) Hint: Parameter "AReferenceWhite" not used
generatedcolorspace.inc(2351,179) Hint: Parameter "AReferenceWhite" not used
generatedcolorspace.inc(2380,167) Hint: Parameter "AReferenceWhite" not used
generatedcolorspace.inc(2390,177) Hint: Parameter "AReferenceWhite" not used
generatedcolorspace.inc(2400,185) Hint: Parameter "AReferenceWhite" not used
generatedcolorspace.inc(2410,179) Hint: Parameter "AReferenceWhite" not used
generatedcolorspace.inc(2445,167) Hint: Parameter "AReferenceWhite" not used
generatedcolorspace.inc(110,46) Hint: Parameter "AColor" not used
generatedcolorspace.inc(113,44) Hint: Parameter "AIndex" not used
generatedcolorspace.inc(130,44) Hint: Parameter "AIndex" not used
generatedcolorspace.inc(147,44) Hint: Parameter "AIndex" not used
generatedcolorspace.inc(164,44) Hint: Parameter "AIndex" not used
generatedcolorspace.inc(181,44) Hint: Parameter "AIndex" not used
generatedcolorspace.inc(198,44) Hint: Parameter "AIndex" not used
generatedcolorspace.inc(215,44) Hint: Parameter "AIndex" not used
generatedcolorspace.inc(229,46) Hint: Parameter "AColor" not used
generatedcolorspace.inc(232,44) Hint: Parameter "AIndex" not used
generatedcolorspace.inc(246,46) Hint: Parameter "AColor" not used
generatedcolorspace.inc(249,44) Hint: Parameter "AIndex" not used
generatedcolorspace.inc(266,44) Hint: Parameter "AIndex" not used
generatedcolorspace.inc(283,44) Hint: Parameter "AIndex" not used
generatedcolorspace.inc(300,44) Hint: Parameter "AIndex" not used
generatedcolorspace.inc(317,44) Hint: Parameter "AIndex" not used
generatedcolorspace.inc(334,44) Hint: Parameter "AIndex" not used
generatedcolorspace.inc(351,44) Hint: Parameter "AIndex" not used
generatedcolorspace.inc(368,44) Hint: Parameter "AIndex" not used
generatedcolorspace.inc(385,44) Hint: Parameter "AIndex" not used
generatedcolorspace.inc(5637,7) Note: Call to subroutine "procedure ChromaticAdaptXYZ(var X:Single;var Y:Single;var Z:Single;const AFrom:TXYZReferenceWhite;const ATo:TXYZReferenceWhite);" marked as inline is not inlined
generatedcolorspace.inc(5831,7) Note: Call to subroutine "procedure ChromaticAdaptWordXYZ(var X:Word;var Y:Word;var Z:Word;const AFrom:TXYZReferenceWhite;const ATo:TXYZReferenceWhite);" marked as inline is not inlined
bgrabitmaptypes.pas(641,19) Hint: Function result variable of a managed type does not seem to be initialized
bgrabitmaptypes.pas(392,48) Hint: Parameter "orientationTenthDegCCW" not used
bgrabitmaptypes.pas(393,49) Hint: Parameter "orientationTenthDegCCW" not used
bgrabitmaptypes.pas(401,117) Hint: Parameter "ARightToLeft" not used
bgrabitmaptypes.pas(406,125) Hint: Parameter "ARightToLeft" not used
bgrabitmaptypes.pas(410,155) Hint: Parameter "ARightToLeft" not used
bgrabitmaptypes.pas(413,163) Hint: Parameter "ARightToLeft" not used
bgrabitmaptypes.pas(427,35) Hint: Parameter "ADest" not used
bgrabitmaptypes.pas(427,58) Hint: Parameter "x" not used
bgrabitmaptypes.pas(427,66) Hint: Parameter "y" not used
bgrabitmaptypes.pas(427,82) Hint: Parameter "s" not used
bgrabitmaptypes.pas(427,98) Hint: Parameter "align" not used
bgrabitmaptypes.pas(428,122) Hint: Parameter "ARightToLeft" not used
bgrabitmaptypes.pas(1043,48) Hint: Local variable "targaPixelFormat" does not seem to be initialized
bgrabitmaptypes.pas(1099,24) Hint: Local variable "magic" does not seem to be initialized
bgrabitmaptypes.pas(1110,26) Hint: Local variable "magicAsText" of a managed type does not seem to be initialized
Assembling bgrabitmaptypes
fgl.pp(930,1) Hint: "inherited" not yet supported inside inline procedure/function
fgl.pp(930,1) Hint: Inlining disabled
fgl.pp(945,1) Hint: "inherited" not yet supported inside inline procedure/function
fgl.pp(945,1) Hint: Inlining disabled
fgl.pp(1005,1) Hint: "inherited" not yet supported inside inline procedure/function
fgl.pp(1005,1) Hint: Inlining disabled
fgl.pp(1010,1) Hint: "inherited" not yet supported inside inline procedure/function
fgl.pp(1010,1) Hint: Inlining disabled
fgl.pp(963,1) Hint: "inherited" not yet supported inside inline procedure/function
fgl.pp(963,1) Hint: Inlining disabled
fgl.pp(968,1) Hint: "inherited" not yet supported inside inline procedure/function
fgl.pp(968,1) Hint: Inlining disabled
fgl.pp(950,1) Hint: "inherited" not yet supported inside inline procedure/function
fgl.pp(950,1) Hint: Inlining disabled
fgl.pp(955,1) Hint: "inherited" not yet supported inside inline procedure/function
fgl.pp(955,1) Hint: Inlining disabled
fgl.pp(997,1) Hint: "inherited" not yet supported inside inline procedure/function
fgl.pp(997,1) Hint: Inlining disabled
fgl.pp(1023,7) Note: Call to subroutine "function TFPGList<BGRAMultiFileType.TMultiFileEntry>.Add(const Item:TMultiFileEntry):LongInt;" marked as inline is not inlined
fgl.pp(1023,20) Note: Call to subroutine "function TFPGList<BGRAMultiFileType.TMultiFileEntry>.Get(Index:LongInt):TMultiFileEntry;" marked as inline is not inlined
bgramultifiletype.pas(49,26) Hint: Parameter "ADestination" not used
bgramultifiletype.pas(223,21) Note: Call to subroutine "function TFPGList<BGRAMultiFileType.TMultiFileEntry>.Get(Index:LongInt):TMultiFileEntry;" marked as inline is not inlined
bgramultifiletype.pas(232,21) Hint: Function result variable of a managed type does not seem to be initialized
bgramultifiletype.pas(279,5) Note: Call to subroutine "procedure TFPGList<BGRAMultiFileType.TMultiFileEntry>.Insert(Index:LongInt;const Item:TMultiFileEntry);" marked as inline is not inlined
bgramultifiletype.pas(283,23) Note: Call to subroutine "function TFPGList<BGRAMultiFileType.TMultiFileEntry>.Add(const Item:TMultiFileEntry):LongInt;" marked as inline is not inlined
bgramultifiletype.pas(462,22) Note: Call to subroutine "function TFPGList<BGRAMultiFileType.TMultiFileEntry>.Get(Index:LongInt):TMultiFileEntry;" marked as inline is not inlined
Assembling bgramultifiletype
Compiling bgradefaultbitmap.pas
Compiling bgracanvas.pas
Compiling bgrapen.pas
Compiling bgratransform.pas
Compiling bgrablend.pas
bgrablend.pas(160,11) Note: Call to subroutine "procedure DrawExpandedPixelInlineNoAlphaCheck(dest:PBGRAPixel;const ec:TExpandedPixel;calpha:Byte);" marked as inline is not inlined
bgrablend.pas(179,41) Hint: Parameter "AFixedData" not used
bgrablend.pas(180,40) Hint: Parameter "AAlpha" not used
bgrablend.pas(202,7) Note: Call to subroutine "procedure DrawExpandedPixelInlineNoAlphaCheck(dest:PBGRAPixel;const ec:TExpandedPixel;calpha:Byte);" marked as inline is not inlined
bgrablend.pas(228,9) Note: Call to subroutine "procedure FastBlendPixelInline(dest:PBGRAPixel;const c:TBGRAPixel);" marked as inline is not inlined
bgrablend.pas(238,9) Note: Call to subroutine "procedure FastBlendPixelInline(dest:PBGRAPixel;const c:TBGRAPixel);" marked as inline is not inlined
bgrablend.pas(598,11) Note: Call to subroutine "procedure DrawPixelInlineWithAlphaCheck(dest:PBGRAPixel;const c:TBGRAPixel);" marked as inline is not inlined
bgrablend.pas(610,11) Note: Call to subroutine "procedure DrawPixelInlineWithAlphaCheck(dest:PBGRAPixel;c:TBGRAPixel;appliedOpacity:Byte);" marked as inline is not inlined
bgrablend.pas(611,11) Note: Call to subroutine "procedure DrawPixelInlineWithAlphaCheck(dest:PBGRAPixel;c:TBGRAPixel;appliedOpacity:Byte);" marked as inline is not inlined
bgrablend.pas(612,11) Note: Call to subroutine "procedure DrawPixelInlineWithAlphaCheck(dest:PBGRAPixel;c:TBGRAPixel;appliedOpacity:Byte);" marked as inline is not inlined
bgrablend.pas(613,11) Note: Call to subroutine "procedure DrawPixelInlineWithAlphaCheck(dest:PBGRAPixel;c:TBGRAPixel;appliedOpacity:Byte);" marked as inline is not inlined
bgrablend.pas(621,9) Note: Call to subroutine "procedure DrawPixelInlineWithAlphaCheck(dest:PBGRAPixel;c:TBGRAPixel;appliedOpacity:Byte);" marked as inline is not inlined
bgrablend.pas(660,13) Note: Call to subroutine "procedure DrawPixelInlineWithAlphaCheck(dest:PBGRAPixel;const c:TBGRAPixel);" marked as inline is not inlined
bgrablend.pas(678,13) Note: Call to subroutine "procedure DrawPixelInlineWithAlphaCheck(dest:PBGRAPixel;c:TBGRAPixel;appliedOpacity:Byte);" marked as inline is not inlined
bgrablend.pas(716,11) Note: Call to subroutine "procedure FastBlendPixelInline(dest:PBGRAPixel;const c:TBGRAPixel);" marked as inline is not inlined
bgrablend.pas(728,11) Note: Call to subroutine "procedure FastBlendPixelInline(dest:PBGRAPixel;c:TBGRAPixel;appliedOpacity:Byte);" marked as inline is not inlined
bgrablend.pas(729,11) Note: Call to subroutine "procedure FastBlendPixelInline(dest:PBGRAPixel;c:TBGRAPixel;appliedOpacity:Byte);" marked as inline is not inlined
bgrablend.pas(730,11) Note: Call to subroutine "procedure FastBlendPixelInline(dest:PBGRAPixel;c:TBGRAPixel;appliedOpacity:Byte);" marked as inline is not inlined
bgrablend.pas(731,11) Note: Call to subroutine "procedure FastBlendPixelInline(dest:PBGRAPixel;c:TBGRAPixel;appliedOpacity:Byte);" marked as inline is not inlined
bgrablend.pas(739,9) Note: Call to subroutine "procedure FastBlendPixelInline(dest:PBGRAPixel;c:TBGRAPixel;appliedOpacity:Byte);" marked as inline is not inlined
bgrablend.pas(778,13) Note: Call to subroutine "procedure FastBlendPixelInline(dest:PBGRAPixel;const c:TBGRAPixel);" marked as inline is not inlined
bgrablend.pas(796,13) Note: Call to subroutine "procedure FastBlendPixelInline(dest:PBGRAPixel;c:TBGRAPixel;appliedOpacity:Byte);" marked as inline is not inlined
bgrablend.pas(986,5) Note: Call to subroutine "procedure ErasePixelInline(dest:PBGRAPixel;alpha:Byte);" marked as inline is not inlined
bgrablend.pas(1019,27) Note: Call to subroutine "function ApplyOpacity(opacity1:Byte;opacity2:Byte):Byte;" marked as inline is not inlined
bgrablend.pas(1036,27) Note: Call to subroutine "function ApplyOpacity(opacity1:Byte;opacity2:Byte):Byte;" marked as inline is not inlined
bgrablend.pas(1036,87) Note: Call to subroutine "function ApplyOpacity(opacity1:Byte;opacity2:Byte):Byte;" marked as inline is not inlined
bgrablend.pas(1094,5) Note: Call to subroutine "procedure AlphaFillInline(dest:PBGRAPixel;alpha:Byte;Count:LongInt);" marked as inline is not inlined
bgrablend.pas(1256,9) Note: Call to subroutine "procedure ClearTypeDrawPixel(pdest:PBGRAPixel;Cr:Byte;Cg:Byte;Cb:Byte;Color:TBGRAPixel);" marked as inline is not inlined
bgrablend.pas(1256,9) Note: Call to subroutine "procedure ClearTypeDrawPixel(pdest:PBGRAPixel;Cr:Byte;Cg:Byte;Cb:Byte;Color:TBGRAPixel);" marked as inline is not inlined
bgrablend.pas(1269,7) Note: Call to subroutine "procedure ClearTypeDrawPixel(pdest:PBGRAPixel;Cr:Byte;Cg:Byte;Cb:Byte;Color:TBGRAPixel);" marked as inline is not inlined
bgrablend.pas(1269,7) Note: Call to subroutine "procedure ClearTypeDrawPixel(pdest:PBGRAPixel;Cr:Byte;Cg:Byte;Cb:Byte;Color:TBGRAPixel);" marked as inline is not inlined
bgrablend.pas(1270,7) Note: Call to subroutine "procedure ClearTypeDrawPixel(pdest:PBGRAPixel;Cr:Byte;Cg:Byte;Cb:Byte;Color:TBGRAPixel);" marked as inline is not inlined
bgrablend.pas(1270,7) Note: Call to subroutine "procedure ClearTypeDrawPixel(pdest:PBGRAPixel;Cr:Byte;Cg:Byte;Cb:Byte;Color:TBGRAPixel);" marked as inline is not inlined
bgrablend.pas(1272,7) Note: Call to subroutine "procedure ClearTypeDrawPixel(pdest:PBGRAPixel;Cr:Byte;Cg:Byte;Cb:Byte;Color:TBGRAPixel);" marked as inline is not inlined
bgrablend.pas(1272,7) Note: Call to subroutine "procedure ClearTypeDrawPixel(pdest:PBGRAPixel;Cr:Byte;Cg:Byte;Cb:Byte;Color:TBGRAPixel);" marked as inline is not inlined
bgrablend.pas(1157,26) Note: Call to subroutine "procedure ClearTypeDrawPixel(pdest:PBGRAPixel;Cr:Byte;Cg:Byte;Cb:Byte;Color:TBGRAPixel);" marked as inline is not inlined
bgrablend.pas(1157,26) Note: Call to subroutine "procedure ClearTypeDrawPixel(pdest:PBGRAPixel;Cr:Byte;Cg:Byte;Cb:Byte;Color:TBGRAPixel);" marked as inline is not inlined
bgrablend.pas(1148,7) Note: Call to subroutine "procedure ClearTypeDrawPixel(pdest:PBGRAPixel;Cr:Byte;Cg:Byte;Cb:Byte;Color:TBGRAPixel);" marked as inline is not inlined
bgrablend.pas(1148,7) Note: Call to subroutine "procedure ClearTypeDrawPixel(pdest:PBGRAPixel;Cr:Byte;Cg:Byte;Cb:Byte;Color:TBGRAPixel);" marked as inline is not inlined
bgrablend.pas(1137,7) Note: Call to subroutine "procedure ClearTypeDrawPixel(pdest:PBGRAPixel;Cr:Byte;Cg:Byte;Cb:Byte;Color:TBGRAPixel);" marked as inline is not inlined
bgrablend.pas(1139,7) Note: Call to subroutine "procedure ClearTypeDrawPixel(pdest:PBGRAPixel;Cr:Byte;Cg:Byte;Cb:Byte;Color:TBGRAPixel);" marked as inline is not inlined
bgrablend.pas(1319,9) Note: Call to subroutine "procedure ClearTypeDrawPixel(pdest:PBGRAPixel;Cr:Byte;Cg:Byte;Cb:Byte;Color:TBGRAPixel);" marked as inline is not inlined
bgrablend.pas(1328,9) Note: Call to subroutine "procedure ClearTypeDrawPixel(pdest:PBGRAPixel;Cr:Byte;Cg:Byte;Cb:Byte;Color:TBGRAPixel);" marked as inline is not inlined
bgrablend.pas(1341,9) Note: Call to subroutine "function ApplyOpacity(opacity1:Byte;opacity2:Byte):Byte;" marked as inline is not inlined
bgrablend.pas(1342,9) Note: Call to subroutine "function ApplyOpacity(opacity1:Byte;opacity2:Byte):Byte;" marked as inline is not inlined
bgrablend.pas(1343,9) Note: Call to subroutine "function ApplyOpacity(opacity1:Byte;opacity2:Byte):Byte;" marked as inline is not inlined
bgrablend.pas(1361,7) Note: Call to subroutine "procedure DrawPixelInlineWithAlphaCheck(dest:PBGRAPixel;c:TBGRAPixel;appliedOpacity:Byte);" marked as inline is not inlined
bgrablend.pas(1369,45) Note: Call to subroutine "function ApplyOpacity(opacity1:Byte;opacity2:Byte):Byte;" marked as inline is not inlined
bgrablend.pas(1467,11) Note: Call to subroutine "procedure FastBlendPixelInline(dest:PBGRAPixel;const c:TBGRAPixel);" marked as inline is not inlined
bgrablend.pas(1473,11) Note: Call to subroutine "procedure DrawPixelInlineWithAlphaCheck(dest:PBGRAPixel;const c:TBGRAPixel);" marked as inline is not inlined
blendpixels.inc(5,9) Note: Call to subroutine "procedure FastBlendPixelInline(dest:PBGRAPixel;const c:TBGRAPixel);" marked as inline is not inlined
blendpixels.inc(16,11) Note: Call to subroutine "procedure DrawPixelInlineWithAlphaCheck(dest:PBGRAPixel;const c:TBGRAPixel);" marked as inline is not inlined
blendpixels.inc(27,11) Note: Call to subroutine "procedure LinearMultiplyPixelInline(dest:PBGRAPixel;c:TBGRAPixel);" marked as inline is not inlined
blendpixels.inc(38,11) Note: Call to subroutine "procedure AddPixelInline(dest:PBGRAPixel;c:TBGRAPixel);" marked as inline is not inlined
blendpixels.inc(49,11) Note: Call to subroutine "procedure LinearAddPixelInline(dest:PBGRAPixel;c:TBGRAPixel);" marked as inline is not inlined
blendpixels.inc(60,9) Note: Call to subroutine "procedure ColorBurnPixelInline(dest:PBGRAPixel;c:TBGRAPixel);" marked as inline is not inlined
blendpixels.inc(71,11) Note: Call to subroutine "procedure ColorDodgePixelInline(dest:PBGRAPixel;c:TBGRAPixel);" marked as inline is not inlined
blendpixels.inc(82,9) Note: Call to subroutine "procedure DividePixelInline(dest:PBGRAPixel;c:TBGRAPixel);" marked as inline is not inlined
blendpixels.inc(93,11) Note: Call to subroutine "procedure ReflectPixelInline(dest:PBGRAPixel;c:TBGRAPixel);" marked as inline is not inlined
blendpixels.inc(104,11) Note: Call to subroutine "procedure GlowPixelInline(dest:PBGRAPixel;c:TBGRAPixel);" marked as inline is not inlined
blendpixels.inc(115,11) Note: Call to subroutine "procedure NiceGlowPixelInline(dest:PBGRAPixel;c:TBGRAPixel);" marked as inline is not inlined
blendpixels.inc(126,11) Note: Call to subroutine "procedure OverlayPixelInline(dest:PBGRAPixel;c:TBGRAPixel);" marked as inline is not inlined
blendpixels.inc(137,11) Note: Call to subroutine "procedure LinearOverlayPixelInline(dest:PBGRAPixel;c:TBGRAPixel);" marked as inline is not inlined
blendpixels.inc(148,11) Note: Call to subroutine "procedure DifferencePixelInline(dest:PBGRAPixel;c:TBGRAPixel);" marked as inline is not inlined
blendpixels.inc(159,11) Note: Call to subroutine "procedure LinearDifferencePixelInline(dest:PBGRAPixel;c:TBGRAPixel);" marked as inline is not inlined
blendpixels.inc(170,9) Note: Call to subroutine "procedure ExclusionPixelInline(dest:PBGRAPixel;c:TBGRAPixel);" marked as inline is not inlined
blendpixels.inc(181,11) Note: Call to subroutine "procedure LinearExclusionPixelInline(dest:PBGRAPixel;c:TBGRAPixel);" marked as inline is not inlined
blendpixels.inc(192,11) Note: Call to subroutine "procedure LinearSubtractPixelInline(dest:PBGRAPixel;c:TBGRAPixel);" marked as inline is not inlined
blendpixels.inc(203,11) Note: Call to subroutine "procedure LinearSubtractInversePixelInline(dest:PBGRAPixel;c:TBGRAPixel);" marked as inline is not inlined
blendpixels.inc(214,11) Note: Call to subroutine "procedure SubtractPixelInline(dest:PBGRAPixel;c:TBGRAPixel);" marked as inline is not inlined
blendpixels.inc(225,11) Note: Call to subroutine "procedure SubtractInversePixelInline(dest:PBGRAPixel;c:TBGRAPixel);" marked as inline is not inlined
blendpixels.inc(236,11) Note: Call to subroutine "procedure NegationPixelInline(dest:PBGRAPixel;c:TBGRAPixel);" marked as inline is not inlined
blendpixels.inc(247,11) Note: Call to subroutine "procedure LinearNegationPixelInline(dest:PBGRAPixel;c:TBGRAPixel);" marked as inline is not inlined
blendpixels.inc(258,11) Note: Call to subroutine "procedure LightenPixelInline(dest:PBGRAPixel;c:TBGRAPixel);" marked as inline is not inlined
blendpixels.inc(269,11) Note: Call to subroutine "procedure DarkenPixelInline(dest:PBGRAPixel;c:TBGRAPixel);" marked as inline is not inlined
blendpixels.inc(280,9) Note: Call to subroutine "procedure ScreenPixelInline(dest:PBGRAPixel;c:TBGRAPixel);" marked as inline is not inlined
blendpixels.inc(291,11) Note: Call to subroutine "procedure SoftLightPixelInline(dest:PBGRAPixel;c:TBGRAPixel);" marked as inline is not inlined
blendpixels.inc(302,11) Note: Call to subroutine "procedure SvgSoftLightPixelInline(dest:PBGRAPixel;c:TBGRAPixel);" marked as inline is not inlined
blendpixels.inc(313,11) Note: Call to subroutine "procedure HardLightPixelInline(dest:PBGRAPixel;c:TBGRAPixel);" marked as inline is not inlined
blendpixels.inc(324,11) Note: Call to subroutine "procedure BlendXorPixelInline(dest:PBGRAPixel;c:TBGRAPixel);" marked as inline is not inlined
bgrablend.pas(1544,5) Note: Call to subroutine "procedure FastBlendPixelInline(dest:PBGRAPixel;const c:TBGRAPixel);" marked as inline is not inlined
bgrablend.pas(1557,11) Note: Call to subroutine "procedure CopyPixelsWithOpacity(dest:PBGRAPixel;src:PBGRAPixel;opacity:Byte;Count:LongInt);" marked as inline is not inlined
bgrablend.pas(1573,34) Note: Call to subroutine "function ApplyOpacity(opacity1:Byte;opacity2:Byte):Byte;" marked as inline is not inlined
bgrablend.pas(1574,15) Note: Call to subroutine "procedure FastBlendPixelInline(dest:PBGRAPixel;const c:TBGRAPixel);" marked as inline is not inlined
bgrablend.pas(1594,13) Note: Call to subroutine "procedure DrawPixelInlineWithAlphaCheck(dest:PBGRAPixel;c:TBGRAPixel;appliedOpacity:Byte);" marked as inline is not inlined
bgrablend.pas(1602,13) Note: Call to subroutine "procedure DrawPixelInlineWithAlphaCheck(dest:PBGRAPixel;const c:TBGRAPixel);" marked as inline is not inlined
bgrablend.pas(1613,13) Note: Call to subroutine "procedure FastBlendPixelInline(dest:PBGRAPixel;c:TBGRAPixel;appliedOpacity:Byte);" marked as inline is not inlined
bgrablend.pas(1620,13) Note: Call to subroutine "procedure FastBlendPixelInline(dest:PBGRAPixel;const c:TBGRAPixel);" marked as inline is not inlined
bgrablend.pas(1631,13) Note: Call to subroutine "procedure FastBlendPixelInline(dest:PBGRAPixel;c:TBGRAPixel;appliedOpacity:Byte);" marked as inline is not inlined
bgrablend.pas(1655,5) Note: Call to subroutine "procedure DrawExpandedPixelInlineNoAlphaCheck(dest:PBGRAPixel;const ec:TExpandedPixel;calpha:Byte);" marked as inline is not inlined
bgrablend.pas(1675,5) Note: Call to subroutine "procedure DrawExpandedPixelInlineNoAlphaCheck(dest:PBGRAPixel;const ec:TExpandedPixel;calpha:Byte);" marked as inline is not inlined
bgrablend.pas(1692,5) Note: Call to subroutine "procedure DrawExpandedPixelInlineNoAlphaCheck(dest:PBGRAPixel;const ec:TExpandedPixel;calpha:Byte);" marked as inline is not inlined
bgrablend.pas(1704,5) Note: Call to subroutine "procedure DrawPixelInlineDiff(dest:PBGRAPixel;c:TBGRAPixel;compare:TBGRAPixel;maxDiff:Byte);" marked as inline is not inlined
bgrablend.pas(1715,5) Note: Call to subroutine "procedure DrawPixelInlineNoAlphaCheck(dest:PBGRAPixel;const c:TBGRAPixel);" marked as inline is not inlined
bgrablend.pas(1721,14) Note: Call to subroutine "function ApplyOpacity(opacity1:Byte;opacity2:Byte):Byte;" marked as inline is not inlined
bgrablend.pas(1722,3) Note: Call to subroutine "procedure DrawPixelInlineNoAlphaCheck(dest:PBGRAPixel;const c:TBGRAPixel);" marked as inline is not inlined
bgrablend.pas(1756,5) Note: Call to subroutine "procedure DrawExpandedPixelInlineNoAlphaCheck(dest:PBGRAPixel;const ec:TExpandedPixel;calpha:Byte);" marked as inline is not inlined
bgrablend.pas(1766,5) Note: Call to subroutine "procedure DrawExpandedPixelInlineNoAlphaCheck(dest:PBGRAPixel;const ec:TExpandedPixel;calpha:Byte);" marked as inline is not inlined
bgrablend.pas(1899,5) Note: Call to subroutine "procedure DrawPixelInlineNoAlphaCheck(dest:PBGRAPixel;const c:TBGRAPixel);" marked as inline is not inlined
blendpixelsover.inc(7,11) Note: Call to subroutine "procedure FastBlendPixelInline(dest:PBGRAPixel;const c:TBGRAPixel);" marked as inline is not inlined
blendpixelsover.inc(18,11) Note: Call to subroutine "procedure DrawPixelInlineNoAlphaCheck(dest:PBGRAPixel;const c:TBGRAPixel);" marked as inline is not inlined
blendpixelsover.inc(31,11) Note: Call to subroutine "procedure LinearMultiplyPixelInline(dest:PBGRAPixel;c:TBGRAPixel);" marked as inline is not inlined
blendpixelsover.inc(32,11) Note: Call to subroutine "procedure FastBlendPixelInline(dest:PBGRAPixel;const c:TBGRAPixel);" marked as inline is not inlined
blendpixelsover.inc(45,11) Note: Call to subroutine "procedure LinearMultiplyPixelInline(dest:PBGRAPixel;c:TBGRAPixel);" marked as inline is not inlined
blendpixelsover.inc(46,11) Note: Call to subroutine "procedure DrawPixelInlineNoAlphaCheck(dest:PBGRAPixel;const c:TBGRAPixel);" marked as inline is not inlined
blendpixelsover.inc(59,11) Note: Call to subroutine "procedure AddPixelInline(dest:PBGRAPixel;c:TBGRAPixel);" marked as inline is not inlined
blendpixelsover.inc(60,11) Note: Call to subroutine "procedure FastBlendPixelInline(dest:PBGRAPixel;const c:TBGRAPixel);" marked as inline is not inlined
blendpixelsover.inc(73,11) Note: Call to subroutine "procedure AddPixelInline(dest:PBGRAPixel;c:TBGRAPixel);" marked as inline is not inlined
blendpixelsover.inc(74,11) Note: Call to subroutine "procedure DrawPixelInlineNoAlphaCheck(dest:PBGRAPixel;const c:TBGRAPixel);" marked as inline is not inlined
blendpixelsover.inc(87,11) Note: Call to subroutine "procedure LinearAddPixelInline(dest:PBGRAPixel;c:TBGRAPixel);" marked as inline is not inlined
blendpixelsover.inc(88,11) Note: Call to subroutine "procedure FastBlendPixelInline(dest:PBGRAPixel;const c:TBGRAPixel);" marked as inline is not inlined
blendpixelsover.inc(101,11) Note: Call to subroutine "procedure LinearAddPixelInline(dest:PBGRAPixel;c:TBGRAPixel);" marked as inline is not inlined
blendpixelsover.inc(102,11) Note: Call to subroutine "procedure DrawPixelInlineNoAlphaCheck(dest:PBGRAPixel;const c:TBGRAPixel);" marked as inline is not inlined
blendpixelsover.inc(115,11) Note: Call to subroutine "procedure ColorBurnPixelInline(dest:PBGRAPixel;c:TBGRAPixel);" marked as inline is not inlined
blendpixelsover.inc(116,11) Note: Call to subroutine "procedure FastBlendPixelInline(dest:PBGRAPixel;const c:TBGRAPixel);" marked as inline is not inlined
blendpixelsover.inc(129,11) Note: Call to subroutine "procedure ColorBurnPixelInline(dest:PBGRAPixel;c:TBGRAPixel);" marked as inline is not inlined
blendpixelsover.inc(130,11) Note: Call to subroutine "procedure DrawPixelInlineNoAlphaCheck(dest:PBGRAPixel;const c:TBGRAPixel);" marked as inline is not inlined
blendpixelsover.inc(143,11) Note: Call to subroutine "procedure ColorDodgePixelInline(dest:PBGRAPixel;c:TBGRAPixel);" marked as inline is not inlined
blendpixelsover.inc(144,11) Note: Call to subroutine "procedure FastBlendPixelInline(dest:PBGRAPixel;const c:TBGRAPixel);" marked as inline is not inlined
blendpixelsover.inc(157,11) Note: Call to subroutine "procedure ColorDodgePixelInline(dest:PBGRAPixel;c:TBGRAPixel);" marked as inline is not inlined
blendpixelsover.inc(158,11) Note: Call to subroutine "procedure DrawPixelInlineNoAlphaCheck(dest:PBGRAPixel;const c:TBGRAPixel);" marked as inline is not inlined
blendpixelsover.inc(171,11) Note: Call to subroutine "procedure DividePixelInline(dest:PBGRAPixel;c:TBGRAPixel);" marked as inline is not inlined
blendpixelsover.inc(172,11) Note: Call to subroutine "procedure FastBlendPixelInline(dest:PBGRAPixel;const c:TBGRAPixel);" marked as inline is not inlined
blendpixelsover.inc(185,11) Note: Call to subroutine "procedure DividePixelInline(dest:PBGRAPixel;c:TBGRAPixel);" marked as inline is not inlined
blendpixelsover.inc(186,11) Note: Call to subroutine "procedure DrawPixelInlineNoAlphaCheck(dest:PBGRAPixel;const c:TBGRAPixel);" marked as inline is not inlined
blendpixelsover.inc(199,11) Note: Call to subroutine "procedure ReflectPixelInline(dest:PBGRAPixel;c:TBGRAPixel);" marked as inline is not inlined
blendpixelsover.inc(200,11) Note: Call to subroutine "procedure FastBlendPixelInline(dest:PBGRAPixel;const c:TBGRAPixel);" marked as inline is not inlined
blendpixelsover.inc(213,11) Note: Call to subroutine "procedure ReflectPixelInline(dest:PBGRAPixel;c:TBGRAPixel);" marked as inline is not inlined
blendpixelsover.inc(214,11) Note: Call to subroutine "procedure DrawPixelInlineNoAlphaCheck(dest:PBGRAPixel;const c:TBGRAPixel);" marked as inline is not inlined
blendpixelsover.inc(227,11) Note: Call to subroutine "procedure GlowPixelInline(dest:PBGRAPixel;c:TBGRAPixel);" marked as inline is not inlined
blendpixelsover.inc(228,11) Note: Call to subroutine "procedure FastBlendPixelInline(dest:PBGRAPixel;const c:TBGRAPixel);" marked as inline is not inlined
blendpixelsover.inc(241,11) Note: Call to subroutine "procedure GlowPixelInline(dest:PBGRAPixel;c:TBGRAPixel);" marked as inline is not inlined
blendpixelsover.inc(242,11) Note: Call to subroutine "procedure DrawPixelInlineNoAlphaCheck(dest:PBGRAPixel;const c:TBGRAPixel);" marked as inline is not inlined
blendpixelsover.inc(255,11) Note: Call to subroutine "procedure NiceGlowPixelInline(dest:PBGRAPixel;c:TBGRAPixel);" marked as inline is not inlined
blendpixelsover.inc(256,11) Note: Call to subroutine "procedure FastBlendPixelInline(dest:PBGRAPixel;const c:TBGRAPixel);" marked as inline is not inlined
blendpixelsover.inc(269,11) Note: Call to subroutine "procedure NiceGlowPixelInline(dest:PBGRAPixel;c:TBGRAPixel);" marked as inline is not inlined
blendpixelsover.inc(270,11) Note: Call to subroutine "procedure DrawPixelInlineNoAlphaCheck(dest:PBGRAPixel;const c:TBGRAPixel);" marked as inline is not inlined
blendpixelsover.inc(283,11) Note: Call to subroutine "procedure OverlayPixelInline(dest:PBGRAPixel;c:TBGRAPixel);" marked as inline is not inlined
blendpixelsover.inc(284,11) Note: Call to subroutine "procedure FastBlendPixelInline(dest:PBGRAPixel;const c:TBGRAPixel);" marked as inline is not inlined
blendpixelsover.inc(297,11) Note: Call to subroutine "procedure OverlayPixelInline(dest:PBGRAPixel;c:TBGRAPixel);" marked as inline is not inlined
blendpixelsover.inc(298,11) Note: Call to subroutine "procedure DrawPixelInlineNoAlphaCheck(dest:PBGRAPixel;const c:TBGRAPixel);" marked as inline is not inlined
blendpixelsover.inc(311,11) Note: Call to subroutine "procedure LinearOverlayPixelInline(dest:PBGRAPixel;c:TBGRAPixel);" marked as inline is not inlined
blendpixelsover.inc(312,11) Note: Call to subroutine "procedure FastBlendPixelInline(dest:PBGRAPixel;const c:TBGRAPixel);" marked as inline is not inlined
blendpixelsover.inc(325,11) Note: Call to subroutine "procedure LinearOverlayPixelInline(dest:PBGRAPixel;c:TBGRAPixel);" marked as inline is not inlined
blendpixelsover.inc(326,11) Note: Call to subroutine "procedure DrawPixelInlineNoAlphaCheck(dest:PBGRAPixel;const c:TBGRAPixel);" marked as inline is not inlined
blendpixelsover.inc(339,11) Note: Call to subroutine "procedure DifferencePixelInline(dest:PBGRAPixel;c:TBGRAPixel);" marked as inline is not inlined
blendpixelsover.inc(340,11) Note: Call to subroutine "procedure FastBlendPixelInline(dest:PBGRAPixel;const c:TBGRAPixel);" marked as inline is not inlined
blendpixelsover.inc(353,11) Note: Call to subroutine "procedure DifferencePixelInline(dest:PBGRAPixel;c:TBGRAPixel);" marked as inline is not inlined
blendpixelsover.inc(354,11) Note: Call to subroutine "procedure DrawPixelInlineNoAlphaCheck(dest:PBGRAPixel;const c:TBGRAPixel);" marked as inline is not inlined
blendpixelsover.inc(367,11) Note: Call to subroutine "procedure LinearDifferencePixelInline(dest:PBGRAPixel;c:TBGRAPixel);" marked as inline is not inlined
blendpixelsover.inc(368,11) Note: Call to subroutine "procedure FastBlendPixelInline(dest:PBGRAPixel;const c:TBGRAPixel);" marked as inline is not inlined
blendpixelsover.inc(381,11) Note: Call to subroutine "procedure LinearDifferencePixelInline(dest:PBGRAPixel;c:TBGRAPixel);" marked as inline is not inlined
blendpixelsover.inc(382,11) Note: Call to subroutine "procedure DrawPixelInlineNoAlphaCheck(dest:PBGRAPixel;const c:TBGRAPixel);" marked as inline is not inlined
blendpixelsover.inc(395,11) Note: Call to subroutine "procedure ExclusionPixelInline(dest:PBGRAPixel;c:TBGRAPixel);" marked as inline is not inlined
blendpixelsover.inc(396,11) Note: Call to subroutine "procedure FastBlendPixelInline(dest:PBGRAPixel;const c:TBGRAPixel);" marked as inline is not inlined
blendpixelsover.inc(409,11) Note: Call to subroutine "procedure ExclusionPixelInline(dest:PBGRAPixel;c:TBGRAPixel);" marked as inline is not inlined
blendpixelsover.inc(410,11) Note: Call to subroutine "procedure DrawPixelInlineNoAlphaCheck(dest:PBGRAPixel;const c:TBGRAPixel);" marked as inline is not inlined
blendpixelsover.inc(423,11) Note: Call to subroutine "procedure LinearExclusionPixelInline(dest:PBGRAPixel;c:TBGRAPixel);" marked as inline is not inlined
blendpixelsover.inc(424,11) Note: Call to subroutine "procedure FastBlendPixelInline(dest:PBGRAPixel;const c:TBGRAPixel);" marked as inline is not inlined
blendpixelsover.inc(437,11) Note: Call to subroutine "procedure LinearExclusionPixelInline(dest:PBGRAPixel;c:TBGRAPixel);" marked as inline is not inlined
blendpixelsover.inc(438,11) Note: Call to subroutine "procedure DrawPixelInlineNoAlphaCheck(dest:PBGRAPixel;const c:TBGRAPixel);" marked as inline is not inlined
blendpixelsover.inc(451,11) Note: Call to subroutine "procedure LinearSubtractPixelInline(dest:PBGRAPixel;c:TBGRAPixel);" marked as inline is not inlined
blendpixelsover.inc(452,11) Note: Call to subroutine "procedure FastBlendPixelInline(dest:PBGRAPixel;const c:TBGRAPixel);" marked as inline is not inlined
blendpixelsover.inc(465,11) Note: Call to subroutine "procedure LinearSubtractPixelInline(dest:PBGRAPixel;c:TBGRAPixel);" marked as inline is not inlined
blendpixelsover.inc(466,11) Note: Call to subroutine "procedure DrawPixelInlineNoAlphaCheck(dest:PBGRAPixel;const c:TBGRAPixel);" marked as inline is not inlined
blendpixelsover.inc(479,11) Note: Call to subroutine "procedure LinearSubtractInversePixelInline(dest:PBGRAPixel;c:TBGRAPixel);" marked as inline is not inlined
blendpixelsover.inc(480,11) Note: Call to subroutine "procedure FastBlendPixelInline(dest:PBGRAPixel;const c:TBGRAPixel);" marked as inline is not inlined
blendpixelsover.inc(493,11) Note: Call to subroutine "procedure LinearSubtractInversePixelInline(dest:PBGRAPixel;c:TBGRAPixel);" marked as inline is not inlined
blendpixelsover.inc(494,11) Note: Call to subroutine "procedure DrawPixelInlineNoAlphaCheck(dest:PBGRAPixel;const c:TBGRAPixel);" marked as inline is not inlined
blendpixelsover.inc(507,11) Note: Call to subroutine "procedure SubtractPixelInline(dest:PBGRAPixel;c:TBGRAPixel);" marked as inline is not inlined
blendpixelsover.inc(508,11) Note: Call to subroutine "procedure FastBlendPixelInline(dest:PBGRAPixel;const c:TBGRAPixel);" marked as inline is not inlined
blendpixelsover.inc(521,11) Note: Call to subroutine "procedure SubtractPixelInline(dest:PBGRAPixel;c:TBGRAPixel);" marked as inline is not inlined
blendpixelsover.inc(522,11) Note: Call to subroutine "procedure DrawPixelInlineNoAlphaCheck(dest:PBGRAPixel;const c:TBGRAPixel);" marked as inline is not inlined
blendpixelsover.inc(535,11) Note: Call to subroutine "procedure SubtractInversePixelInline(dest:PBGRAPixel;c:TBGRAPixel);" marked as inline is not inlined
blendpixelsover.inc(536,11) Note: Call to subroutine "procedure FastBlendPixelInline(dest:PBGRAPixel;const c:TBGRAPixel);" marked as inline is not inlined
blendpixelsover.inc(549,11) Note: Call to subroutine "procedure SubtractInversePixelInline(dest:PBGRAPixel;c:TBGRAPixel);" marked as inline is not inlined
blendpixelsover.inc(550,11) Note: Call to subroutine "procedure DrawPixelInlineNoAlphaCheck(dest:PBGRAPixel;const c:TBGRAPixel);" marked as inline is not inlined
blendpixelsover.inc(563,11) Note: Call to subroutine "procedure NegationPixelInline(dest:PBGRAPixel;c:TBGRAPixel);" marked as inline is not inlined
blendpixelsover.inc(564,11) Note: Call to subroutine "procedure FastBlendPixelInline(dest:PBGRAPixel;const c:TBGRAPixel);" marked as inline is not inlined
blendpixelsover.inc(577,11) Note: Call to subroutine "procedure NegationPixelInline(dest:PBGRAPixel;c:TBGRAPixel);" marked as inline is not inlined
blendpixelsover.inc(578,11) Note: Call to subroutine "procedure DrawPixelInlineNoAlphaCheck(dest:PBGRAPixel;const c:TBGRAPixel);" marked as inline is not inlined
blendpixelsover.inc(591,11) Note: Call to subroutine "procedure LinearNegationPixelInline(dest:PBGRAPixel;c:TBGRAPixel);" marked as inline is not inlined
blendpixelsover.inc(592,11) Note: Call to subroutine "procedure FastBlendPixelInline(dest:PBGRAPixel;const c:TBGRAPixel);" marked as inline is not inlined
blendpixelsover.inc(605,11) Note: Call to subroutine "procedure LinearNegationPixelInline(dest:PBGRAPixel;c:TBGRAPixel);" marked as inline is not inlined
blendpixelsover.inc(606,11) Note: Call to subroutine "procedure DrawPixelInlineNoAlphaCheck(dest:PBGRAPixel;const c:TBGRAPixel);" marked as inline is not inlined
blendpixelsover.inc(619,11) Note: Call to subroutine "procedure LightenPixelInline(dest:PBGRAPixel;c:TBGRAPixel);" marked as inline is not inlined
blendpixelsover.inc(620,11) Note: Call to subroutine "procedure FastBlendPixelInline(dest:PBGRAPixel;const c:TBGRAPixel);" marked as inline is not inlined
blendpixelsover.inc(633,11) Note: Call to subroutine "procedure LightenPixelInline(dest:PBGRAPixel;c:TBGRAPixel);" marked as inline is not inlined
blendpixelsover.inc(634,11) Note: Call to subroutine "procedure DrawPixelInlineNoAlphaCheck(dest:PBGRAPixel;const c:TBGRAPixel);" marked as inline is not inlined
blendpixelsover.inc(647,11) Note: Call to subroutine "procedure DarkenPixelInline(dest:PBGRAPixel;c:TBGRAPixel);" marked as inline is not inlined
blendpixelsover.inc(648,11) Note: Call to subroutine "procedure FastBlendPixelInline(dest:PBGRAPixel;const c:TBGRAPixel);" marked as inline is not inlined
blendpixelsover.inc(661,11) Note: Call to subroutine "procedure DarkenPixelInline(dest:PBGRAPixel;c:TBGRAPixel);" marked as inline is not inlined
blendpixelsover.inc(662,11) Note: Call to subroutine "procedure DrawPixelInlineNoAlphaCheck(dest:PBGRAPixel;const c:TBGRAPixel);" marked as inline is not inlined
blendpixelsover.inc(675,11) Note: Call to subroutine "procedure ScreenPixelInline(dest:PBGRAPixel;c:TBGRAPixel);" marked as inline is not inlined
blendpixelsover.inc(676,11) Note: Call to subroutine "procedure FastBlendPixelInline(dest:PBGRAPixel;const c:TBGRAPixel);" marked as inline is not inlined
blendpixelsover.inc(689,11) Note: Call to subroutine "procedure ScreenPixelInline(dest:PBGRAPixel;c:TBGRAPixel);" marked as inline is not inlined
blendpixelsover.inc(690,11) Note: Call to subroutine "procedure DrawPixelInlineNoAlphaCheck(dest:PBGRAPixel;const c:TBGRAPixel);" marked as inline is not inlined
blendpixelsover.inc(703,11) Note: Call to subroutine "procedure SoftLightPixelInline(dest:PBGRAPixel;c:TBGRAPixel);" marked as inline is not inlined
blendpixelsover.inc(704,11) Note: Call to subroutine "procedure FastBlendPixelInline(dest:PBGRAPixel;const c:TBGRAPixel);" marked as inline is not inlined
blendpixelsover.inc(717,11) Note: Call to subroutine "procedure SvgSoftLightPixelInline(dest:PBGRAPixel;c:TBGRAPixel);" marked as inline is not inlined
blendpixelsover.inc(718,11) Note: Call to subroutine "procedure FastBlendPixelInline(dest:PBGRAPixel;const c:TBGRAPixel);" marked as inline is not inlined
blendpixelsover.inc(731,11) Note: Call to subroutine "procedure SoftLightPixelInline(dest:PBGRAPixel;c:TBGRAPixel);" marked as inline is not inlined
blendpixelsover.inc(732,11) Note: Call to subroutine "procedure DrawPixelInlineNoAlphaCheck(dest:PBGRAPixel;const c:TBGRAPixel);" marked as inline is not inlined
blendpixelsover.inc(745,11) Note: Call to subroutine "procedure SvgSoftLightPixelInline(dest:PBGRAPixel;c:TBGRAPixel);" marked as inline is not inlined
blendpixelsover.inc(746,11) Note: Call to subroutine "procedure DrawPixelInlineNoAlphaCheck(dest:PBGRAPixel;const c:TBGRAPixel);" marked as inline is not inlined
blendpixelsover.inc(759,11) Note: Call to subroutine "procedure HardLightPixelInline(dest:PBGRAPixel;c:TBGRAPixel);" marked as inline is not inlined
blendpixelsover.inc(760,11) Note: Call to subroutine "procedure FastBlendPixelInline(dest:PBGRAPixel;const c:TBGRAPixel);" marked as inline is not inlined
blendpixelsover.inc(773,11) Note: Call to subroutine "procedure HardLightPixelInline(dest:PBGRAPixel;c:TBGRAPixel);" marked as inline is not inlined
blendpixelsover.inc(774,11) Note: Call to subroutine "procedure DrawPixelInlineNoAlphaCheck(dest:PBGRAPixel;const c:TBGRAPixel);" marked as inline is not inlined
blendpixelsover.inc(787,11) Note: Call to subroutine "procedure BlendXorPixelInline(dest:PBGRAPixel;c:TBGRAPixel);" marked as inline is not inlined
blendpixelsover.inc(788,11) Note: Call to subroutine "procedure FastBlendPixelInline(dest:PBGRAPixel;const c:TBGRAPixel);" marked as inline is not inlined
blendpixelsover.inc(801,11) Note: Call to subroutine "procedure BlendXorPixelInline(dest:PBGRAPixel;c:TBGRAPixel);" marked as inline is not inlined
blendpixelsover.inc(802,11) Note: Call to subroutine "procedure DrawPixelInlineNoAlphaCheck(dest:PBGRAPixel;const c:TBGRAPixel);" marked as inline is not inlined
blendpixelinline.inc(955,43) Note: Call to subroutine "function ByteSqrt(value:Byte):Byte;" marked as inline is not inlined
blendpixelinline.inc(970,18) Note: Call to subroutine "function ByteSqrt(value:Byte):Byte;" marked as inline is not inlined
blendpixelinline.inc(971,20) Note: Call to subroutine "function ByteSqrt(value:Byte):Byte;" marked as inline is not inlined
blendpixelinline.inc(972,20) Note: Call to subroutine "function ByteSqrt(value:Byte):Byte;" marked as inline is not inlined
blendpixelinline.inc(976,21) Note: Call to subroutine "function ByteSqrt(value:Byte):Byte;" marked as inline is not inlined
blendpixelinline.inc(978,21) Note: Call to subroutine "function ByteSqrt(value:Byte):Byte;" marked as inline is not inlined
blendpixelinline.inc(980,21) Note: Call to subroutine "function ByteSqrt(value:Byte):Byte;" marked as inline is not inlined
Assembling bgrablend
bgratransform.pas(430,19) Warning: function result variable of a managed type does not seem to be initialized
bgratransform.pas(934,3) Note: Call to subroutine "procedure TBGRAAffineScannerTransform.ScanMoveToF(X:Single;Y:Single);" marked as inline is not inlined
bgratransform.pas(990,3) Note: Call to subroutine "procedure TBGRAQuadLinearScanner.GetTexColorAt(u:Single;v:Single;out AColor:TBGRAPixel;out AIsPadding:Boolean);" marked as inline is not inlined
bgratransform.pas(1141,15) Note: Call to subroutine "procedure TBGRAQuadLinearScanner.GetTexColorAt(u:Single;v:Single;out AColor:TBGRAPixel;out AIsPadding:Boolean);" marked as inline is not inlined
bgratransform.pas(1152,15) Note: Call to subroutine "procedure TBGRAQuadLinearScanner.GetTexColorAt(u:Single;v:Single;out AColor:TBGRAPixel;out AIsPadding:Boolean);" marked as inline is not inlined
bgratransform.pas(1162,15) Note: Call to subroutine "procedure TBGRAQuadLinearScanner.GetTexColorAt(u:Single;v:Single;out AColor:TBGRAPixel;out AIsPadding:Boolean);" marked as inline is not inlined
bgratransform.pas(1172,15) Note: Call to subroutine "procedure TBGRAQuadLinearScanner.GetTexColorAt(u:Single;v:Single;out AColor:TBGRAPixel;out AIsPadding:Boolean);" marked as inline is not inlined
bgratransform.pas(1189,15) Note: Call to subroutine "procedure TBGRAQuadLinearScanner.GetTexColorAt(u:Single;v:Single;out AColor:TBGRAPixel;out AIsPadding:Boolean);" marked as inline is not inlined
bgratransform.pas(1259,9) Note: Call to subroutine "procedure TBGRAQuadLinearScanner.GetTexColorAt(u:Single;v:Single;out AColor:TBGRAPixel;out AIsPadding:Boolean);" marked as inline is not inlined
bgratransform.pas(1260,9) Note: Call to subroutine "procedure TBGRAQuadLinearScanner.GetTexColorAt(u:Single;v:Single;out AColor:TBGRAPixel;out AIsPadding:Boolean);" marked as inline is not inlined
bgratransform.pas(1271,12) Note: Call to subroutine "procedure TBGRAQuadLinearScanner.GetTexColorAt(u:Single;v:Single;out AColor:TBGRAPixel;out AIsPadding:Boolean);" marked as inline is not inlined
bgratransform.pas(1275,7) Note: Call to subroutine "procedure TBGRAQuadLinearScanner.GetTexColorAt(u:Single;v:Single;out AColor:TBGRAPixel;out AIsPadding:Boolean);" marked as inline is not inlined
bgratransform.pas(1326,5) Note: Call to subroutine "procedure TBGRAQuadLinearScanner.GetTexColorAt(u:Single;v:Single;out AColor:TBGRAPixel;out AIsPadding:Boolean);" marked as inline is not inlined
bgratransform.pas(1360,7) Note: Call to subroutine "procedure TBGRAQuadLinearScanner.GetTexColorAt(u:Single;v:Single;out AColor:TBGRAPixel;out AIsPadding:Boolean);" marked as inline is not inlined
bgratransform.pas(2039,15) Note: Call to subroutine "function Sin65536(value:Word):Int64;" marked as inline is not inlined
bgratransform.pas(2040,15) Note: Call to subroutine "function Sin65536(value:Word):Int64;" marked as inline is not inlined
Assembling bgratransform
Compiling bgrapath.pas
Compiling bgraresample.pas
bgraresample.pas(470,15) Note: Call to subroutine "procedure DrawPixelInlineNoAlphaCheck(dest:PBGRAPixel;const c:TBGRAPixel);" marked as inline is not inlined
bgraresample.pas(562,15) Note: Call to subroutine "procedure DrawPixelInlineNoAlphaCheck(dest:PBGRAPixel;const c:TBGRAPixel);" marked as inline is not inlined
bgraresample.pas(606,17) Hint: Local variable "psrc" of a managed type does not seem to be initialized
bgraresample.pas(680,15) Note: Call to subroutine "procedure DrawPixelInlineNoAlphaCheck(dest:PBGRAPixel;const c:TBGRAPixel);" marked as inline is not inlined
bgraresample.pas(948,17) Hint: Local variable "yTab" of a managed type does not seem to be initialized
bgraresample.pas(957,17) Hint: Local variable "xTab" of a managed type does not seem to be initialized
bgraresample.pas(1467,24) Hint: Local variable "verticalSum" of a managed type does not seem to be initialized
bgraresample.pas(1469,25) Hint: Local variable "scanlinesSrc" of a managed type does not seem to be initialized
Assembling bgraresample
bgrapath.pas(389,21) Warning: function result variable of a managed type does not seem to be initialized
bgrapath.pas(392,19) Hint: Local variable "curves" of a managed type does not seem to be initialized
bgrapath.pas(439,21) Warning: function result variable of a managed type does not seem to be initialized
bgrapath.pas(442,19) Hint: Local variable "curves" of a managed type does not seem to be initialized
bgrapath.pas(677,19) Warning: function result variable of a managed type does not seem to be initialized
bgrapath.pas(683,31) Note: Call to subroutine "function Sin65536(value:Word):Int64;" marked as inline is not inlined
bgrapath.pas(684,31) Note: Call to subroutine "function Sin65536(value:Word):Int64;" marked as inline is not inlined
bgrapath.pas(1480,16) Hint: Local variable "sub" of a managed type does not seem to be initialized
bgrapath.pas(1497,25) Hint: Local variable "temp" of a managed type does not seem to be initialized
bgrapath.pas(1986,22) Hint: Local variable "pts" of a managed type does not seem to be initialized
bgrapath.pas(2030,18) Hint: Local variable "sub" of a managed type does not seem to be initialized
bgrapath.pas(2048,27) Hint: Local variable "temp" of a managed type does not seem to be initialized
bgrapath.pas(3008,26) Hint: Local variable "pts" of a managed type does not seem to be initialized
Assembling bgrapath
bgrapen.pas(206,19) Warning: function result variable of a managed type does not seem to be initialized
bgrapen.pas(494,23) Warning: function result variable of a managed type does not seem to be initialized
bgrapen.pas(708,16) Hint: Local variable "pts" of a managed type does not seem to be initialized
bgrapen.pas(789,20) Hint: Local variable "borders" of a managed type does not seem to be initialized
bgrapen.pas(1096,23) Hint: Local variable "subPts" of a managed type does not seem to be initialized
bgrapen.pas(1124,19) Warning: function result variable of a managed type does not seem to be initialized
Assembling bgrapen
Compiling bgrapolygon.pas
Compiling bgrafillinfo.pas
bgrafillinfo.pas(657,19) Warning: function result variable of a managed type does not seem to be initialized
bgrafillinfo.pas(914,19) Warning: function result variable of a managed type does not seem to be initialized
bgrafillinfo.pas(190,37) Hint: Parameter "numPt" not used
bgrafillinfo.pas(190,49) Hint: Parameter "nextPt" not used
bgrafillinfo.pas(190,71) Hint: Parameter "ASeg" not used
bgrafillinfo.pas(183,118) Hint: Parameter "dy" not used
bgrafillinfo.pas(183,135) Hint: Parameter "AData" not used
bgrafillinfo.pas(1095,18) Hint: Local variable "yList" of a managed type does not seem to be initialized
bgrafillinfo.pas(1334,3) Note: Local variable "temp" not used
bgrafillinfo.pas(1388,7) Note: Local variable "j" not used
Assembling bgrafillinfo
Compiling bgragradientscanner.pas
bgragradientscanner.pas(377,25) Note: Call to subroutine "function Sin65536(value:Word):Int64;" marked as inline is not inlined
bgragradientscanner.pas(426,25) Note: Call to subroutine "function Sin65536(value:Word):Int64;" marked as inline is not inlined
bgragradientscanner.pas(225,33) Hint: Parameter "X" not used
bgragradientscanner.pas(225,41) Hint: Parameter "Y" not used
bgragradientscanner.pas(227,26) Hint: Parameter "X" not used
bgragradientscanner.pas(227,34) Hint: Parameter "Y" not used
bgragradientscanner.pas(966,23) Note: Call to subroutine "operator *(const c1:TColorF;factor:Single):Array[1..4] Of Single;" marked as inline is not inlined
bgragradientscanner.pas(1096,68) Note: Call to subroutine "function Sin65536(value:Word):Int64;" marked as inline is not inlined
bgragradientscanner.pas(1115,76) Note: Call to subroutine "function Sin65536(value:Word):Int64;" marked as inline is not inlined
bgragradientscanner.pas(1552,31) Note: Call to subroutine "procedure DrawExpandedPixelInlineNoAlphaCheck(dest:PBGRAPixel;const ec:TExpandedPixel;calpha:Byte);" marked as inline is not inlined
bgragradientscanner.pas(1553,22) Note: Call to subroutine "procedure FastBlendPixelInline(dest:PBGRAPixel;const c:TBGRAPixel);" marked as inline is not inlined
bgragradientscanner.pas(1565,9) Note: Call to subroutine "procedure DrawPixelInlineNoAlphaCheck(dest:PBGRAPixel;const c:TBGRAPixel);" marked as inline is not inlined
bgragradientscanner.pas(1675,66) Note: Call to subroutine "function ApplyOpacity(opacity1:Byte;opacity2:Byte):Byte;" marked as inline is not inlined
bgragradientscanner.pas(1675,13) Note: Call to subroutine "procedure DrawPixelInlineNoAlphaCheck(dest:PBGRAPixel;const c:TBGRAPixel);" marked as inline is not inlined
bgragradientscanner.pas(1682,57) Note: Call to subroutine "function ApplyOpacity(opacity1:Byte;opacity2:Byte):Byte;" marked as inline is not inlined
bgragradientscanner.pas(1715,13) Note: Call to subroutine "procedure DrawPixelInlineNoAlphaCheck(dest:PBGRAPixel;const c:TBGRAPixel);" marked as inline is not inlined
bgragradientscanner.pas(1828,11) Note: Call to subroutine "procedure DrawPixelInlineNoAlphaCheck(dest:PBGRAPixel;const c:TBGRAPixel);" marked as inline is not inlined
bgragradientscanner.pas(1953,9) Note: Call to subroutine "procedure DrawPixelInlineNoAlphaCheck(dest:PBGRAPixel;const c:TBGRAPixel);" marked as inline is not inlined
Assembling bgragradientscanner
bgrapolygon.pas(1169,21) Hint: Local variable "shapeRow" of a managed type does not seem to be initialized
bgrapolygon.pas(1180,17) Hint: Local variable "sums" of a managed type does not seem to be initialized
bgrapolygon.pas(1181,26) Hint: Local variable "shapeRowsList" of a managed type does not seem to be initialized
bgrapolygon.pas(1253,20) Note: Call to subroutine "procedure DrawExpandedPixelInlineNoAlphaCheck(dest:PBGRAPixel;const ec:TExpandedPixel;calpha:Byte);" marked as inline is not inlined
bgrapolygon.pas(1286,20) Note: Call to subroutine "procedure DrawExpandedPixelInlineNoAlphaCheck(dest:PBGRAPixel;const ec:TExpandedPixel;calpha:Byte);" marked as inline is not inlined
Assembling bgrapolygon
Compiling bgrapolygonaliased.pas
Compiling bgrasse.pas
Assembling bgrasse
bgrapolygonaliased.pas(335,10) Note: Local variable "cInt" not used
bgrapolygonaliased.pas(341,29) Note: Call to subroutine "operator -(const c1:TColorF;const c2:TColorF):Array[1..4] Of Single;" marked as inline is not inlined
bgrapolygonaliased.pas(392,7) Note: Call to subroutine "procedure DrawPixelInlineNoAlphaCheck(dest:PBGRAPixel;const c:TBGRAPixel);" marked as inline is not inlined
bgrapolygonaliased.pas(532,24) Note: Local variable "colorPosByZ" not used
perspectivecolorscan.inc(93,11) Note: Call to subroutine "procedure DrawPixelInlineNoAlphaCheck(dest:PBGRAPixel;const c:TBGRAPixel);" marked as inline is not inlined
perspectivecolorscan.inc(93,11) Note: Call to subroutine "procedure DrawPixelInlineNoAlphaCheck(dest:PBGRAPixel;const c:TBGRAPixel);" marked as inline is not inlined
lineartexscan.inc(9,5) Note: Local variable "intTexPos" not used
lineartexscan.inc(9,5) Note: Local variable "intTexPos" not used
lineartexscan2.inc(30,11) Note: Call to subroutine "function ApplyLightnessFast(color:TBGRAPixel;lightness:Word):<record type>;" marked as inline is not inlined
lineartexscan2.inc(18,9) Note: Call to subroutine "procedure DrawPixelInlineNoAlphaCheck(dest:PBGRAPixel;const c:TBGRAPixel);" marked as inline is not inlined
lineartexscan2.inc(30,11) Note: Call to subroutine "function ApplyLightnessFast(color:TBGRAPixel;lightness:Word):<record type>;" marked as inline is not inlined
lineartexscan2.inc(18,9) Note: Call to subroutine "procedure DrawPixelInlineNoAlphaCheck(dest:PBGRAPixel;const c:TBGRAPixel);" marked as inline is not inlined
lineartexscan2.inc(18,9) Note: Call to subroutine "procedure DrawPixelInlineNoAlphaCheck(dest:PBGRAPixel;const c:TBGRAPixel);" marked as inline is not inlined
lineartexscan2.inc(18,9) Note: Call to subroutine "procedure DrawPixelInlineNoAlphaCheck(dest:PBGRAPixel;const c:TBGRAPixel);" marked as inline is not inlined
polyaliaspersp.inc(32,20) Hint: Local variable "lPoints" of a managed type does not seem to be initialized
polyaliaspersp.inc(64,20) Hint: Local variable "lPoints" of a managed type does not seem to be initialized
perspectivescan.inc(11,6) Note: Local variable "texPosByZ" not used
perspectivescan.inc(12,6) Note: Local variable "intTexPos" not used
perspectivescan.inc(11,6) Note: Local variable "texPosByZ" not used
perspectivescan.inc(12,6) Note: Local variable "intTexPos" not used
perspectivescan.inc(11,6) Note: Local variable "texPosByZ" not used
perspectivescan.inc(12,6) Note: Local variable "intTexPos" not used
perspectivescan.inc(11,6) Note: Local variable "texPosByZ" not used
perspectivescan.inc(12,6) Note: Local variable "intTexPos" not used
perspectivescan2.inc(136,13) Note: Call to subroutine "function ApplyLightnessFast(color:TBGRAPixel;lightness:Word):<record type>;" marked as inline is not inlined
perspectivescan2.inc(114,11) Note: Call to subroutine "procedure DrawPixelInlineNoAlphaCheck(dest:PBGRAPixel;const c:TBGRAPixel);" marked as inline is not inlined
perspectivescan2.inc(136,13) Note: Call to subroutine "function ApplyLightnessFast(color:TBGRAPixel;lightness:Word):<record type>;" marked as inline is not inlined
perspectivescan2.inc(114,11) Note: Call to subroutine "procedure DrawPixelInlineNoAlphaCheck(dest:PBGRAPixel;const c:TBGRAPixel);" marked as inline is not inlined
perspectivescan2.inc(114,11) Note: Call to subroutine "procedure DrawPixelInlineNoAlphaCheck(dest:PBGRAPixel;const c:TBGRAPixel);" marked as inline is not inlined
perspectivescan2.inc(114,11) Note: Call to subroutine "procedure DrawPixelInlineNoAlphaCheck(dest:PBGRAPixel;const c:TBGRAPixel);" marked as inline is not inlined
perspectivescan2.inc(136,13) Note: Call to subroutine "function ApplyLightnessFast(color:TBGRAPixel;lightness:Word):<record type>;" marked as inline is not inlined
perspectivescan2.inc(114,11) Note: Call to subroutine "procedure DrawPixelInlineNoAlphaCheck(dest:PBGRAPixel;const c:TBGRAPixel);" marked as inline is not inlined
perspectivescan2.inc(136,13) Note: Call to subroutine "function ApplyLightnessFast(color:TBGRAPixel;lightness:Word):<record type>;" marked as inline is not inlined
perspectivescan2.inc(114,11) Note: Call to subroutine "procedure DrawPixelInlineNoAlphaCheck(dest:PBGRAPixel;const c:TBGRAPixel);" marked as inline is not inlined
perspectivescan2.inc(114,11) Note: Call to subroutine "procedure DrawPixelInlineNoAlphaCheck(dest:PBGRAPixel;const c:TBGRAPixel);" marked as inline is not inlined
perspectivescan2.inc(114,11) Note: Call to subroutine "procedure DrawPixelInlineNoAlphaCheck(dest:PBGRAPixel;const c:TBGRAPixel);" marked as inline is not inlined
perspectivescan.inc(11,6) Note: Local variable "texPosByZ" not used
perspectivescan.inc(12,6) Note: Local variable "intTexPos" not used
perspectivescan2.inc(114,11) Note: Call to subroutine "procedure DrawPixelInlineNoAlphaCheck(dest:PBGRAPixel;const c:TBGRAPixel);" marked as inline is not inlined
perspectivescan2.inc(114,11) Note: Call to subroutine "procedure DrawPixelInlineNoAlphaCheck(dest:PBGRAPixel;const c:TBGRAPixel);" marked as inline is not inlined
perspectivescan2.inc(114,11) Note: Call to subroutine "procedure DrawPixelInlineNoAlphaCheck(dest:PBGRAPixel;const c:TBGRAPixel);" marked as inline is not inlined
perspectivescan2.inc(114,11) Note: Call to subroutine "procedure DrawPixelInlineNoAlphaCheck(dest:PBGRAPixel;const c:TBGRAPixel);" marked as inline is not inlined
perspectivescan.inc(11,6) Note: Local variable "texPosByZ" not used
perspectivescan.inc(12,6) Note: Local variable "intTexPos" not used
perspectivescan2.inc(114,11) Note: Call to subroutine "procedure DrawPixelInlineNoAlphaCheck(dest:PBGRAPixel;const c:TBGRAPixel);" marked as inline is not inlined
perspectivescan2.inc(114,11) Note: Call to subroutine "procedure DrawPixelInlineNoAlphaCheck(dest:PBGRAPixel;const c:TBGRAPixel);" marked as inline is not inlined
perspectivescan2.inc(114,11) Note: Call to subroutine "procedure DrawPixelInlineNoAlphaCheck(dest:PBGRAPixel;const c:TBGRAPixel);" marked as inline is not inlined
perspectivescan2.inc(114,11) Note: Call to subroutine "procedure DrawPixelInlineNoAlphaCheck(dest:PBGRAPixel;const c:TBGRAPixel);" marked as inline is not inlined
perspectivescan.inc(11,6) Note: Local variable "texPosByZ" not used
perspectivescan.inc(12,6) Note: Local variable "intTexPos" not used
perspectivescan2.inc(114,11) Note: Call to subroutine "procedure DrawPixelInlineNoAlphaCheck(dest:PBGRAPixel;const c:TBGRAPixel);" marked as inline is not inlined
perspectivescan2.inc(114,11) Note: Call to subroutine "procedure DrawPixelInlineNoAlphaCheck(dest:PBGRAPixel;const c:TBGRAPixel);" marked as inline is not inlined
perspectivescan2.inc(114,11) Note: Call to subroutine "procedure DrawPixelInlineNoAlphaCheck(dest:PBGRAPixel;const c:TBGRAPixel);" marked as inline is not inlined
perspectivescan2.inc(114,11) Note: Call to subroutine "procedure DrawPixelInlineNoAlphaCheck(dest:PBGRAPixel;const c:TBGRAPixel);" marked as inline is not inlined
perspectivescan.inc(11,6) Note: Local variable "texPosByZ" not used
perspectivescan.inc(12,6) Note: Local variable "intTexPos" not used
perspectivescan2.inc(114,11) Note: Call to subroutine "procedure DrawPixelInlineNoAlphaCheck(dest:PBGRAPixel;const c:TBGRAPixel);" marked as inline is not inlined
perspectivescan2.inc(114,11) Note: Call to subroutine "procedure DrawPixelInlineNoAlphaCheck(dest:PBGRAPixel;const c:TBGRAPixel);" marked as inline is not inlined
perspectivescan2.inc(114,11) Note: Call to subroutine "procedure DrawPixelInlineNoAlphaCheck(dest:PBGRAPixel;const c:TBGRAPixel);" marked as inline is not inlined
perspectivescan2.inc(114,11) Note: Call to subroutine "procedure DrawPixelInlineNoAlphaCheck(dest:PBGRAPixel;const c:TBGRAPixel);" marked as inline is not inlined
polyaliaspersp.inc(504,20) Hint: Local variable "lPoints" of a managed type does not seem to be initialized
polyaliaspersp.inc(538,20) Hint: Local variable "lPoints" of a managed type does not seem to be initialized
bgrapolygonaliased.pas(844,21) Hint: Local variable "EdgeList" of a managed type does not seem to be initialized
Assembling bgrapolygonaliased
bgracanvas.pas(631,27) Hint: Local variable "TempPenStyle" of a managed type does not seem to be initialized
bgracanvas.pas(1267,17) Hint: Local variable "ptsF" of a managed type does not seem to be initialized
bgracanvas.pas(1345,17) Hint: Local variable "ptsF" of a managed type does not seem to be initialized
bgracanvas.pas(1378,22) Hint: Local variable "beziers" of a managed type does not seem to be initialized
Assembling bgracanvas
Compiling bgracanvas2d.pas
Compiling bgragrayscalemask.pas
Compiling universaldrawer.pas
Compiling bgraarrow.pas
bgraarrow.pas(183,22) Hint: Local variable "withCut" of a managed type does not seem to be initialized
Assembling bgraarrow
Compiling bgrareadbmp.pas
bgrareadbmp.pas(146,36) Hint: Local variable "os2header" does not seem to be initialized
bgrareadbmp.pas(232,34) Hint: Local variable "headerSize" does not seem to be initialized
bgrareadbmp.pas(248,35) Hint: Local variable "os2header" does not seem to be initialized
bgrareadbmp.pas(257,35) Hint: Local variable "minHeader" does not seem to be initialized
bgrareadbmp.pas(127,54) Hint: Parameter "AMaxWidth" not used
bgrareadbmp.pas(426,22) Hint: Local variable "ColInfo" of a managed type does not seem to be initialized
bgrareadbmp.pas(433,25) Hint: Local variable "ColInfo3" of a managed type does not seem to be initialized
bgrareadbmp.pas(475,28) Hint: Local variable "os2header" does not seem to be initialized
bgrareadbmp.pas(102,35) Hint: Parameter "Row" not used
bgrareadbmp.pas(103,35) Hint: Parameter "Row" not used
Assembling bgrareadbmp
Compiling bgrareadjpeg.pas
bgrareadjpeg.pas(51,35) Hint: Local variable "magic" does not seem to be initialized
Assembling bgrareadjpeg
Compiling bgrawritetiff.pas
bgrawritetiff.pas(147,33) Hint: Local variable "stream" does not seem to be initialized
Assembling bgrawritetiff
Compiling bgrafilterblur.pas
Compiling bgrafiltertype.pas
Assembling bgrafiltertype
Compiling bgragrayscalemask.pas
bgragrayscalemask.pas(79,45) Hint: Parameter "AFixedData" not used
bgragrayscalemask.pas(80,42) Hint: Parameter "AAlpha" not used
bgragrayscalemask.pas(8,44) Hint: Unit "UniversalDrawer" not used in BGRAGrayscaleMask
Assembling bgragrayscalemask
blurbox.inc(15,10) Note: Local variable "a2" not used
blurbox.inc(114,10) Note: Local variable "a2" not used
blurbox.inc(281,10) Note: Local variable "sumRed3" not used
blurbox.inc(281,33) Note: Local variable "sumBlue3" not used
blurbox.inc(281,57) Note: Local variable "sumCount3" not used
blurbox.inc(15,10) Note: Local variable "a2" not used
blurbox.inc(114,10) Note: Local variable "a2" not used
blurbox.inc(281,10) Note: Local variable "sumRed3" not used
blurbox.inc(281,33) Note: Local variable "sumBlue3" not used
blurbox.inc(281,57) Note: Local variable "sumCount3" not used
blurfast.inc(121,17) Hint: Local variable "sums" of a managed type does not seem to be initialized
blurfast.inc(179,36) Hint: Local variable "extendedTotal" does not seem to be initialized
blurfast.inc(191,28) Hint: Local variable "total" does not seem to be initialized
blurfast.inc(121,17) Hint: Local variable "sums" of a managed type does not seem to be initialized
blurfast.inc(179,36) Hint: Local variable "extendedTotal" does not seem to be initialized
blurfast.inc(191,28) Hint: Local variable "total" does not seem to be initialized
blurnormal.inc(53,23) Hint: Local variable "diffMask" of a managed type does not seem to be initialized
Assembling bgrafilterblur
Assembling universaldrawer
bgracanvas2d.pas(592,19) Warning: function result variable of a managed type does not seem to be initialized
bgracanvas2d.pas(601,19) Warning: function result variable of a managed type does not seem to be initialized
bgracanvas2d.pas(880,19) Warning: function result variable of a managed type does not seem to be initialized
bgracanvas2d.pas(1508,19) Hint: Local variable "ofsPts" of a managed type does not seem to be initialized
bgracanvas2d.pas(1511,20) Hint: Local variable "ofsPts2" of a managed type does not seem to be initialized
bgracanvas2d.pas(1596,19) Warning: function result variable of a managed type does not seem to be initialized
bgracanvas2d.pas(1609,19) Warning: function result variable of a managed type does not seem to be initialized
bgracanvas2d.pas(180,27) Hint: Parameter "dest" not used
bgracanvas2d.pas(2109,18) Hint: Local variable "pts" of a managed type does not seem to be initialized
bgracanvas2d.pas(2519,23) Hint: Local variable "subPts" of a managed type does not seem to be initialized
bgracanvas2d.pas(2566,23) Hint: Local variable "subPts" of a managed type does not seem to be initialized
Assembling bgracanvas2d
Compiling bgratextbidi.pas
Compiling bgraunicodetext.pas
bgraunicodetext.pas(407,19) Hint: Function result variable of a managed type does not seem to be initialized
bgraunicodetext.pas(450,3) Note: Local variable "idxPara" not used
bgraunicodetext.pas(465,3) Note: Local variable "idxPara" is assigned but never used
Assembling bgraunicodetext
bgratextbidi.pas(146,36) Hint: Parameter "ASender" not used
bgratextbidi.pas(147,32) Hint: Parameter "ASender" not used
bgratextbidi.pas(147,81) Hint: Parameter "ACharStart" not used
bgratextbidi.pas(147,98) Hint: Parameter "ACharCount" not used
bgratextbidi.pas(151,35) Hint: Parameter "ASender" not used
bgratextbidi.pas(151,84) Hint: Parameter "ACharIndex" not used
bgratextbidi.pas(148,33) Hint: Parameter "ASender" not used
bgratextbidi.pas(148,82) Hint: Parameter "ACharStart" not used
bgratextbidi.pas(148,99) Hint: Parameter "ACharCount" not used
bgratextbidi.pas(150,44) Hint: Parameter "ASender" not used
bgratextbidi.pas(149,37) Hint: Parameter "ASender" not used
bgratextbidi.pas(141,46) Hint: Parameter "AParagraphIndex" not used
bgratextbidi.pas(1978,21) Warning: function result variable of a managed type does not seem to be initialized
Assembling bgratextbidi
Compiling bgrafilters.pas
Compiling bgrafilterscanner.pas
bgrafilterscanner.pas(44,35) Hint: Parameter "AGammaCorrection" not used
bgrafilterscanner.pas(48,42) Hint: Parameter "ASource" not used
bgrafilterscanner.pas(48,68) Hint: Parameter "ADest" not used
bgrafilterscanner.pas(49,18) Hint: Parameter "ACount" not used
bgrafilterscanner.pas(49,40) Hint: Parameter "AGammaCorrection" not used
bgrafilterscanner.pas(29,29) Hint: Parameter "AGammaCorrection" not used
Assembling bgrafilterscanner
Assembling bgrafilters
Compiling bgradithering.pas
Compiling bgrapalette.pas
paletteformats.inc(111,22) Hint: Local variable "nameBuf" of a managed type does not seem to be initialized
paletteformats.inc(332,21) Hint: Function result variable of a managed type does not seem to be initialized
bgrapalette.pas(125,31) Hint: Parameter "AValue" not used
bgrapalette.pas(164,36) Hint: Parameter "AIndex" not used
bgrapalette.pas(817,19) Warning: function result variable of a managed type does not seem to be initialized
bgrapalette.pas(151,30) Hint: Parameter "AEntry" not used
bgrapalette.pas(960,19) Warning: function result variable of a managed type does not seem to be initialized
bgrapalette.pas(969,19) Warning: function result variable of a managed type does not seem to be initialized
bgrapalette.pas(70,34) Hint: Parameter "Tree" not used
bgrapalette.pas(1350,16) Hint: Local variable "buf" of a managed type does not seem to be initialized
Assembling bgrapalette
bgradithering.pas(74,79) Hint: Parameter "AColor" not used
bgradithering.pas(75,80) Hint: Parameter "AColor" not used
bgradithering.pas(24,48) Hint: Parameter "AColorIndex" not used
bgradithering.pas(513,24) Hint: Local variable "currentLine" of a managed type does not seem to be initialized
bgradithering.pas(514,21) Hint: Local variable "nextLine" of a managed type does not seem to be initialized
Assembling bgradithering
bgradefaultbitmap.pas(1151,5) Note: Call to subroutine "procedure TBGRADefaultBitmap.DiscardBitmapChange;" marked as inline is not inlined
bgradefaultbitmap.pas(1169,5) Note: Call to subroutine "procedure TBGRADefaultBitmap.DiscardBitmapChange;" marked as inline is not inlined
bgradefaultbitmap.pas(1320,3) Note: Call to subroutine "procedure DrawPixelInlineNoAlphaCheck(dest:PBGRAPixel;const c:TBGRAPixel);" marked as inline is not inlined
bgradefaultbitmap.pas(1589,5) Note: Call to subroutine "procedure TBGRADefaultBitmap.DiscardBitmapChange;" marked as inline is not inlined
bgradefaultbitmap.pas(1717,3) Note: Call to subroutine "procedure DrawExpandedPixelInlineNoAlphaCheck(dest:PBGRAPixel;const ec:TExpandedPixel;calpha:Byte);" marked as inline is not inlined
bgradefaultbitmap.pas(1724,3) Note: Call to subroutine "procedure FastBlendPixelInline(dest:PBGRAPixel;const c:TBGRAPixel);" marked as inline is not inlined
bgradefaultbitmap.pas(1818,3) Note: Call to subroutine "function BGRA(red:Byte;green:Byte;blue:Byte;alpha:Byte):<record type>;" marked as inline is not inlined
bgradefaultbitmap.pas(1818,3) Note: Call to subroutine "procedure DrawPixelInlineNoAlphaCheck(dest:PBGRAPixel;const c:TBGRAPixel);" marked as inline is not inlined
bgradefaultbitmap.pas(1847,23) Hint: Local variable "nextchar" of a managed type does not seem to be initialized
bgradefaultbitmap.pas(1875,17) Hint: Local variable "buf1" of a managed type does not seem to be initialized
bgradefaultbitmap.pas(1876,17) Hint: Local variable "buf2" of a managed type does not seem to be initialized
bgradefaultbitmap.pas(1891,31) Note: Call to subroutine "procedure DrawPixelInlineNoAlphaCheck(dest:PBGRAPixel;const c:TBGRAPixel);" marked as inline is not inlined
bgradefaultbitmap.pas(2264,3) Fatal: Internal error 2002090904
Fatal: Compilation aborted
make[2]: *** [Makefile:1279: bgrabitmappack_nogl.ppu] Error 1
make[2]: Leaving directory '/builddir/build/BUILD/ccdciel-0.9.68/component/bgrabitmap'
make[1]: Leaving directory '/builddir/build/BUILD/ccdciel-0.9.68/component'
RPM build errors:
make[1]: *** [Makefile:1738: bgrabitmap_all] Error 2
make: *** [Makefile:1603: component_all] Error 2
error: Bad exit status from /var/tmp/rpm-tmp.mjUxkz (%build)
    Bad exit status from /var/tmp/rpm-tmp.mjUxkz (%build)
Child return code was: 1
EXCEPTION: [Error()]
Traceback (most recent call last):
  File "/usr/lib/python3.7/site-packages/mockbuild/trace_decorator.py", line 93, in trace
    result = func(*args, **kw)
  File "/usr/lib/python3.7/site-packages/mockbuild/util.py", line 755, in do_with_status
    raise exception.Error("Command failed: \n # %s\n%s" % (command, output), child.returncode)
mockbuild.exception.Error: Command failed: 
 # bash --login -c /usr/bin/rpmbuild -bb --target ppc64le --nodeps /builddir/build/SPECS/ccdciel.spec

ccdciel-build.log (95,925 bytes)   

Jonas Maebe

2020-04-19 22:50

manager   ~0122262

Last edited: 2020-04-19 22:50

View 2 revisions

This is a reduced reproducer (compile with -O2):

type
  TPointF = record
    x,y: single;
  end;

procedure test(pt1, pt2, pt3,
  pt4: TPointF; texture: tobject; tex1, tex2, tex3, tex4: TPointF);
begin
end;

begin
end.

It's not trivial to fix though, especially since I discovered we pass homogeneous aggregates that contain single precision floats wrongly right now, and we don't have the overflow into integer registers yet either (as shown in Figure 2.26 of https://openpowerfoundation.org/?resource_lib=64-bit-elf-v2-abi-specification-power-architecture).

Issue History

Date Modified Username Field Change
2020-04-19 14:20 suve New Issue
2020-04-19 14:20 suve File Added: bgrabitmap-build.log
2020-04-19 14:20 suve File Added: ccdciel-build.log
2020-04-19 22:50 Jonas Maebe Note Added: 0122262
2020-04-19 22:50 Jonas Maebe Note Edited: 0122262 View Revisions
2020-04-30 22:53 Jonas Maebe Assigned To => Jonas Maebe
2020-04-30 22:53 Jonas Maebe Status new => resolved
2020-04-30 22:53 Jonas Maebe Resolution open => fixed
2020-04-30 22:53 Jonas Maebe Fixed in Version => 3.3.1
2020-04-30 22:53 Jonas Maebe Fixed in Revision => 45199
2020-04-30 22:53 Jonas Maebe FPCTarget => 3.2.0
2020-05-01 15:03 Jonas Maebe Fixed in Revision 45199 => 45199, 45204, 45205
2020-05-02 15:29 Jonas Maebe Fixed in Revision 45199, 45204, 45205 => 45199, 45204, 45205,45221